[Hippo-cms7-dev] [Hudson] Build failed in Hudson: Test Suite #1650

Hippo Public Hudson Server beheer at onehippo.com
Tue Jan 1 09:05:20 CET 2013


See <https://builds.onehippo.org/job/Test%20Suite/1650/changes>

Changes:

[mnour] CMS7-6770: Cleanup and refresh LICENSE and NOTICE files
  - Ignoring *.iml and .idea from being tracked by SVN

[mnour] CMS7-6770: Cleanup and refresh LICENSE and NOTICE files
  - Added LICENSE and NOTICE files

------------------------------------------
[...truncated 1951 lines...]
[INFO] META-INF/LICENSE already added, skipping
[INFO] META-INF/DEPENDENCIES already added, skipping
[INFO] Building jar: <https://builds.onehippo.org/job/Test%20Suite/ws/trunk/solr/target/solr-sources.jar>
[INFO] META-INF already added, skipping
[INFO] META-INF/NOTICE already added, skipping
[INFO] META-INF/LICENSE already added, skipping
[INFO] META-INF/DEPENDENCIES already added, skipping
[INFO] 
[INFO] --- maven-install-plugin:2.3.1:install (default-install) @ hippo-testsuite-solr ---
[INFO] Installing <https://builds.onehippo.org/job/Test%20Suite/ws/trunk/solr/target/solr.war> to /var/hudson-data/repository/m2/org/onehippo/cms7/hippo-testsuite-solr/1.04.01-SNAPSHOT/hippo-testsuite-solr-1.04.01-SNAPSHOT.war
[INFO] Installing <https://builds.onehippo.org/job/Test%20Suite/ws/trunk/solr/pom.xml> to /var/hudson-data/repository/m2/org/onehippo/cms7/hippo-testsuite-solr/1.04.01-SNAPSHOT/hippo-testsuite-solr-1.04.01-SNAPSHOT.pom
[INFO] Installing <https://builds.onehippo.org/job/Test%20Suite/ws/trunk/solr/target/solr-sources.jar> to /var/hudson-data/repository/m2/org/onehippo/cms7/hippo-testsuite-solr/1.04.01-SNAPSHOT/hippo-testsuite-solr-1.04.01-SNAPSHOT-sources.jar
[INFO] 
[INFO] --- maven-remote-resources-plugin:1.2.1:process (default) @ hippo-testsuite-solr ---
[INFO] 
[INFO] --- maven-resources-plugin:2.6:resources (default-resources) @ hippo-testsuite-solr ---
[INFO] Using 'UTF-8' encoding to copy filtered resources.
[INFO] skip non existing resourceDirectory <https://builds.onehippo.org/job/Test%20Suite/ws/trunk/solr/src/main/resources>
[INFO] Copying 3 resources
[INFO] Copying 3 resources
[INFO] 
[INFO] --- maven-compiler-plugin:2.3.2:compile (default-compile) @ hippo-testsuite-solr ---
[INFO] Nothing to compile - all classes are up to date
[INFO] 
[INFO] --- maven-resources-plugin:2.6:testResources (default-testResources) @ hippo-testsuite-solr ---
[INFO] Using 'UTF-8' encoding to copy filtered resources.
[INFO] skip non existing resourceDirectory <https://builds.onehippo.org/job/Test%20Suite/ws/trunk/solr/src/test/resources>
[INFO] Copying 3 resources
[INFO] Copying 3 resources
[INFO] 
[INFO] --- maven-compiler-plugin:2.3.2:testCompile (default-testCompile) @ hippo-testsuite-solr ---
[INFO] Nothing to compile - all classes are up to date
[INFO] 
[INFO] --- maven-surefire-plugin:2.9:test (default-test) @ hippo-testsuite-solr ---
[INFO] Skipping execution of surefire because it has already been run for this configuration
[HUDSON] Recording test results
[INFO] 
[INFO] --- maven-war-plugin:2.1.1:war (default-war) @ hippo-testsuite-solr ---
[INFO] Packaging webapp
[INFO] Assembling webapp [hippo-testsuite-solr] in [<https://builds.onehippo.org/job/Test%20Suite/ws/trunk/solr/target/solr]>
[INFO] Processing war project
[INFO] Copying webapp resources [<https://builds.onehippo.org/job/Test%20Suite/ws/trunk/solr/src/main/webapp]>
[INFO] Webapp assembled in [132 msecs]
[INFO] Building war: <https://builds.onehippo.org/job/Test%20Suite/ws/trunk/solr/target/solr.war>
[INFO] WEB-INF/web.xml already added, skipping
mojo forkStarted org.apache.maven.plugins:maven-source-plugin:2.1.2(attach-sources)
mojo forkSucceeded org.apache.maven.plugins:maven-source-plugin:2.1.2(attach-sources)
ignoring exception during new ExecutedMojo null
[INFO] 
[INFO] --- maven-source-plugin:2.1.2:jar (attach-sources) @ hippo-testsuite-solr ---
[INFO] META-INF already added, skipping
[INFO] META-INF/NOTICE already added, skipping
[INFO] META-INF/LICENSE already added, skipping
[INFO] META-INF/DEPENDENCIES already added, skipping
[INFO] META-INF already added, skipping
[INFO] META-INF/NOTICE already added, skipping
[INFO] META-INF/LICENSE already added, skipping
[INFO] META-INF/DEPENDENCIES already added, skipping
[INFO] META-INF already added, skipping
[INFO] META-INF/NOTICE already added, skipping
[INFO] META-INF/LICENSE already added, skipping
[INFO] META-INF/DEPENDENCIES already added, skipping
[WARNING] Artifact org.onehippo.cms7:hippo-testsuite-solr:java-source:sources:1.04.01-SNAPSHOT already attached to project, ignoring duplicate
[INFO] 
[INFO] --- maven-install-plugin:2.3.1:install (default-install) @ hippo-testsuite-solr ---
[INFO] Installing <https://builds.onehippo.org/job/Test%20Suite/ws/trunk/solr/target/solr.war> to /var/hudson-data/repository/m2/org/onehippo/cms7/hippo-testsuite-solr/1.04.01-SNAPSHOT/hippo-testsuite-solr-1.04.01-SNAPSHOT.war
[INFO] Installing <https://builds.onehippo.org/job/Test%20Suite/ws/trunk/solr/pom.xml> to /var/hudson-data/repository/m2/org/onehippo/cms7/hippo-testsuite-solr/1.04.01-SNAPSHOT/hippo-testsuite-solr-1.04.01-SNAPSHOT.pom
[INFO] Installing <https://builds.onehippo.org/job/Test%20Suite/ws/trunk/solr/target/solr-sources.jar> to /var/hudson-data/repository/m2/org/onehippo/cms7/hippo-testsuite-solr/1.04.01-SNAPSHOT/hippo-testsuite-solr-1.04.01-SNAPSHOT-sources.jar
[INFO] 
[INFO] --- maven-deploy-plugin:2.6:deploy (default-deploy) @ hippo-testsuite-solr ---
Downloading: https://maven.onehippo.com/content/repositories/snapshots/org/onehippo/cms7/hippo-testsuite-solr/1.04.01-SNAPSHOT/maven-metadata.xml
Downloaded: https://maven.onehippo.com/content/repositories/snapshots/org/onehippo/cms7/hippo-testsuite-solr/1.04.01-SNAPSHOT/maven-metadata.xml (1013 B at 7.3 KB/sec)
Uploading: https://maven.onehippo.com/content/repositories/snapshots/org/onehippo/cms7/hippo-testsuite-solr/1.04.01-SNAPSHOT/hippo-testsuite-solr-1.04.01-20130101.080510-36.war
Jan 1, 2013 9:05:10 AM org.apache.commons.httpclient.auth.AuthChallengeProcessor selectAuthScheme
INFO: basic authentication scheme selected
Jan 1, 2013 9:05:11 AM org.apache.commons.httpclient.auth.AuthChallengeProcessor selectAuthScheme
INFO: basic authentication scheme selected
Jan 1, 2013 9:05:11 AM org.apache.commons.httpclient.auth.AuthChallengeProcessor selectAuthScheme
INFO: basic authentication scheme selected
Uploaded: https://maven.onehippo.com/content/repositories/snapshots/org/onehippo/cms7/hippo-testsuite-solr/1.04.01-SNAPSHOT/hippo-testsuite-solr-1.04.01-20130101.080510-36.war (14107 KB at 16251.9 KB/sec)
Uploading: https://maven.onehippo.com/content/repositories/snapshots/org/onehippo/cms7/hippo-testsuite-solr/1.04.01-SNAPSHOT/hippo-testsuite-solr-1.04.01-20130101.080510-36.pom
Jan 1, 2013 9:05:11 AM org.apache.commons.httpclient.auth.AuthChallengeProcessor selectAuthScheme
INFO: basic authentication scheme selected
Jan 1, 2013 9:05:11 AM org.apache.commons.httpclient.auth.AuthChallengeProcessor selectAuthScheme
INFO: basic authentication scheme selected
Jan 1, 2013 9:05:11 AM org.apache.commons.httpclient.auth.AuthChallengeProcessor selectAuthScheme
INFO: basic authentication scheme selected
Uploaded: https://maven.onehippo.com/content/repositories/snapshots/org/onehippo/cms7/hippo-testsuite-solr/1.04.01-SNAPSHOT/hippo-testsuite-solr-1.04.01-20130101.080510-36.pom (4 KB at 18.6 KB/sec)
Downloading: https://maven.onehippo.com/content/repositories/snapshots/org/onehippo/cms7/hippo-testsuite-solr/maven-metadata.xml
Downloaded: https://maven.onehippo.com/content/repositories/snapshots/org/onehippo/cms7/hippo-testsuite-solr/maven-metadata.xml (403 B at 6.1 KB/sec)
Uploading: https://maven.onehippo.com/content/repositories/snapshots/org/onehippo/cms7/hippo-testsuite-solr/1.04.01-SNAPSHOT/maven-metadata.xml
Jan 1, 2013 9:05:11 AM org.apache.commons.httpclient.auth.AuthChallengeProcessor selectAuthScheme
INFO: basic authentication scheme selected
Jan 1, 2013 9:05:11 AM org.apache.commons.httpclient.auth.AuthChallengeProcessor selectAuthScheme
INFO: basic authentication scheme selected
Jan 1, 2013 9:05:11 AM org.apache.commons.httpclient.auth.AuthChallengeProcessor selectAuthScheme
INFO: basic authentication scheme selected
Uploaded: https://maven.onehippo.com/content/repositories/snapshots/org/onehippo/cms7/hippo-testsuite-solr/1.04.01-SNAPSHOT/maven-metadata.xml (2 KB at 9.7 KB/sec)
Uploading: https://maven.onehippo.com/content/repositories/snapshots/org/onehippo/cms7/hippo-testsuite-solr/maven-metadata.xml
Jan 1, 2013 9:05:11 AM org.apache.commons.httpclient.auth.AuthChallengeProcessor selectAuthScheme
INFO: basic authentication scheme selected
Jan 1, 2013 9:05:11 AM org.apache.commons.httpclient.auth.AuthChallengeProcessor selectAuthScheme
INFO: basic authentication scheme selected
Jan 1, 2013 9:05:11 AM org.apache.commons.httpclient.auth.AuthChallengeProcessor selectAuthScheme
INFO: basic authentication scheme selected
Uploaded: https://maven.onehippo.com/content/repositories/snapshots/org/onehippo/cms7/hippo-testsuite-solr/maven-metadata.xml (806 B at 4.3 KB/sec)
Uploading: https://maven.onehippo.com/content/repositories/snapshots/org/onehippo/cms7/hippo-testsuite-solr/1.04.01-SNAPSHOT/hippo-testsuite-solr-1.04.01-20130101.080510-36-sources.jar
Jan 1, 2013 9:05:11 AM org.apache.commons.httpclient.auth.AuthChallengeProcessor selectAuthScheme
INFO: basic authentication scheme selected
Jan 1, 2013 9:05:11 AM org.apache.commons.httpclient.auth.AuthChallengeProcessor selectAuthScheme
INFO: basic authentication scheme selected
Jan 1, 2013 9:05:11 AM org.apache.commons.httpclient.auth.AuthChallengeProcessor selectAuthScheme
INFO: basic authentication scheme selected
Uploaded: https://maven.onehippo.com/content/repositories/snapshots/org/onehippo/cms7/hippo-testsuite-solr/1.04.01-SNAPSHOT/hippo-testsuite-solr-1.04.01-20130101.080510-36-sources.jar (15 KB at 98.6 KB/sec)
Uploading: https://maven.onehippo.com/content/repositories/snapshots/org/onehippo/cms7/hippo-testsuite-solr/1.04.01-SNAPSHOT/maven-metadata.xml
Jan 1, 2013 9:05:11 AM org.apache.commons.httpclient.auth.AuthChallengeProcessor selectAuthScheme
INFO: basic authentication scheme selected
Jan 1, 2013 9:05:11 AM org.apache.commons.httpclient.auth.AuthChallengeProcessor selectAuthScheme
INFO: basic authentication scheme selected
Jan 1, 2013 9:05:12 AM org.apache.commons.httpclient.auth.AuthChallengeProcessor selectAuthScheme
INFO: basic authentication scheme selected
Uploaded: https://maven.onehippo.com/content/repositories/snapshots/org/onehippo/cms7/hippo-testsuite-solr/1.04.01-SNAPSHOT/maven-metadata.xml (2 KB at 11.2 KB/sec)
projectSucceeded org.onehippo.cms7:hippo-testsuite-solr:1.04.01-SNAPSHOT
[HUDSON] Archiving <https://builds.onehippo.org/job/Test%20Suite/ws/trunk/solr/pom.xml> to /var/hudson-data/jobs/Test Suite/modules/org.onehippo.cms7$hippo-testsuite-solr/builds/2013-01-01_09-01-56/archive/org.onehippo.cms7/hippo-testsuite-solr/1.04.01-SNAPSHOT/pom.xml
[HUDSON] Archiving <https://builds.onehippo.org/job/Test%20Suite/ws/trunk/solr/target/solr.war> to /var/hudson-data/jobs/Test Suite/modules/org.onehippo.cms7$hippo-testsuite-solr/builds/2013-01-01_09-01-56/archive/org.onehippo.cms7/hippo-testsuite-solr/1.04.01-20130101.080510-36/solr.war
[HUDSON] Archiving <https://builds.onehippo.org/job/Test%20Suite/ws/trunk/solr/target/solr-sources.jar> to /var/hudson-data/jobs/Test Suite/modules/org.onehippo.cms7$hippo-testsuite-solr/builds/2013-01-01_09-01-56/archive/org.onehippo.cms7/hippo-testsuite-solr/1.04.01-20130101.080510-36/solr-sources.jar
sessionEnded
[INFO] ------------------------------------------------------------------------
[INFO] Reactor Summary:
[INFO] 
[INFO] Hippo Test Suite .................................. SUCCESS [5.368s]
[INFO] Hippo Test Suite API .............................. SUCCESS [7.004s]
[INFO] Hippo Test Suite Random Numbers ................... SUCCESS [6.512s]
[INFO] Hippo Test Suite Linear Algebra ................... SUCCESS [5.608s]
[INFO] Hippo Test Suite Content .......................... SUCCESS [9.288s]
[INFO] Hippo Test Suite Components ....................... SUCCESS [40.552s]
[INFO] Hippo Test Suite Dependencies ..................... SUCCESS [1.428s]
[INFO] Hippo Test Suite CMS Dependencies ................. SUCCESS [15.028s]
[INFO] Hippo Test Suite Site Dependencies ................ SUCCESS [3.092s]
[INFO] Hippo Test Suite Site Resources ................... SUCCESS [5.736s]
[INFO] Hippo Test Suite CMS .............................. SUCCESS [55.104s]
[INFO] Hippo Test Suite Site ............................. SUCCESS [24.020s]
[INFO] Hippo Test Suite Solr ............................. SUCCESS [7.420s]
[INFO] ------------------------------------------------------------------------
[INFO] BUILD SUCCESS
[INFO] ------------------------------------------------------------------------
[INFO] Total time: 3:14.656s
[INFO] Finished at: Tue Jan 01 09:05:13 CET 2013
[INFO] Final Memory: 25M/91M
[INFO] ------------------------------------------------------------------------
maven builder waiting
channel stopped
[trunk] $ /home/hudson/software/maven/apache-maven-3.0-latest/bin/mvn -f "<https://builds.onehippo.org/job/Test%20Suite/ws/trunk/pom.xml"> -e -B sonar:sonar -Dsonar.jdbc.driver=com.mysql.jdbc.Driver -Dsonar.jdbc.url=jdbc:mysql://172.17.15.19:3306/sonar_public?autoReconnect=true&useUnicode=true&amp;characterEncoding=utf8 ******** ******** -Dsonar.host.url=http://sonar-public.lan:9000
[INFO] Error stacktraces are turned on.
[INFO] Scanning for projects...
[INFO] ------------------------------------------------------------------------
[INFO] Reactor Build Order:
[INFO] 
[INFO] Hippo Test Suite
[INFO] Hippo Test Suite API
[INFO] Hippo Test Suite Random Numbers
[INFO] Hippo Test Suite Linear Algebra
[INFO] Hippo Test Suite Content
[INFO] Hippo Test Suite Components
[INFO] Hippo Test Suite Dependencies
[INFO] Hippo Test Suite CMS Dependencies
[INFO] Hippo Test Suite Site Dependencies
[INFO] Hippo Test Suite Site Resources
[INFO] Hippo Test Suite CMS
[INFO] Hippo Test Suite Site
[INFO] Hippo Test Suite Solr
[INFO]                                                                         
[INFO] ------------------------------------------------------------------------
[INFO] Building Hippo Test Suite 1.04.01-SNAPSHOT
[INFO] ------------------------------------------------------------------------
[WARNING] The POM for org.onehippo.cms7:hippo-cms7-utilities:jar:1.01.03-SNAPSHOT is missing, no dependency information available
[INFO] ------------------------------------------------------------------------
[INFO] Reactor Summary:
[INFO] 
[INFO] Hippo Test Suite .................................. FAILURE [1.208s]
[INFO] Hippo Test Suite API .............................. SKIPPED
[INFO] Hippo Test Suite Random Numbers ................... SKIPPED
[INFO] Hippo Test Suite Linear Algebra ................... SKIPPED
[INFO] Hippo Test Suite Content .......................... SKIPPED
[INFO] Hippo Test Suite Components ....................... SKIPPED
[INFO] Hippo Test Suite Dependencies ..................... SKIPPED
[INFO] Hippo Test Suite CMS Dependencies ................. SKIPPED
[INFO] Hippo Test Suite Site Dependencies ................ SKIPPED
[INFO] Hippo Test Suite Site Resources ................... SKIPPED
[INFO] Hippo Test Suite CMS .............................. SKIPPED
[INFO] Hippo Test Suite Site ............................. SKIPPED
[INFO] Hippo Test Suite Solr ............................. SKIPPED
[INFO] ------------------------------------------------------------------------
[INFO] BUILD FAILURE
[INFO] ------------------------------------------------------------------------
[INFO] Total time: 3.544s
[INFO] Finished at: Tue Jan 01 09:05:19 CET 2013
[INFO] Final Memory: 13M/31M
[INFO] ------------------------------------------------------------------------
[ERROR] Failed to execute goal on project hippo-testsuite-components: Could not resolve dependencies for project org.onehippo.cms7:hippo-testsuite-components:jar:1.04.01-SNAPSHOT: Could not find artifact org.onehippo.cms7:hippo-cms7-utilities:jar:1.01.03-SNAPSHOT -> [Help 1]
org.apache.maven.lifecycle.LifecycleExecutionException: Failed to execute goal on project hippo-testsuite-components: Could not resolve dependencies for project org.onehippo.cms7:hippo-testsuite-components:jar:1.04.01-SNAPSHOT: Could not find artifact org.onehippo.cms7:hippo-cms7-utilities:jar:1.01.03-SNAPSHOT
	at org.apache.maven.lifecycle.internal.LifecycleDependencyResolver.getDependencies(LifecycleDependencyResolver.java:210)
	at org.apache.maven.lifecycle.internal.LifecycleDependencyResolver.resolveProjectDependencies(LifecycleDependencyResolver.java:117)
	at org.apache.maven.lifecycle.internal.MojoExecutor.ensureDependenciesAreResolved(MojoExecutor.java:275)
	at org.apache.maven.lifecycle.internal.MojoExecutor.execute(MojoExecutor.java:201)
	at org.apache.maven.lifecycle.internal.MojoExecutor.execute(MojoExecutor.java:153)
	at org.apache.maven.lifecycle.internal.MojoExecutor.execute(MojoExecutor.java:145)
	at org.apache.maven.lifecycle.internal.LifecycleModuleBuilder.buildProject(LifecycleModuleBuilder.java:84)
	at org.apache.maven.lifecycle.internal.LifecycleModuleBuilder.buildProject(LifecycleModuleBuilder.java:59)
	at org.apache.maven.lifecycle.internal.LifecycleStarter.singleThreadedBuild(LifecycleStarter.java:183)
	at org.apache.maven.lifecycle.internal.LifecycleStarter.execute(LifecycleStarter.java:161)
	at org.apache.maven.DefaultMaven.doExecute(DefaultMaven.java:320)
	at org.apache.maven.DefaultMaven.execute(DefaultMaven.java:156)
	at org.apache.maven.cli.MavenCli.execute(MavenCli.java:537)
	at org.apache.maven.cli.MavenCli.doMain(MavenCli.java:196)
	at org.apache.maven.cli.MavenCli.main(MavenCli.java:141)
	at sun.reflect.NativeMethodAccessorImpl.invoke0(Native Method)
	at sun.reflect.NativeMethodAccessorImpl.invoke(NativeMethodAccessorImpl.java:39)
	at sun.reflect.DelegatingMethodAccessorImpl.invoke(DelegatingMethodAccessorImpl.java:25)
	at java.lang.reflect.Method.invoke(Method.java:597)
	at org.codehaus.plexus.classworlds.launcher.Launcher.launchEnhanced(Launcher.java:290)
	at org.codehaus.plexus.classworlds.launcher.Launcher.launch(Launcher.java:230)
	at org.codehaus.plexus.classworlds.launcher.Launcher.mainWithExitCode(Launcher.java:409)
	at org.codehaus.plexus.classworlds.launcher.Launcher.main(Launcher.java:352)
Caused by: org.apache.maven.project.DependencyResolutionException: Could not resolve dependencies for project org.onehippo.cms7:hippo-testsuite-components:jar:1.04.01-SNAPSHOT: Could not find artifact org.onehippo.cms7:hippo-cms7-utilities:jar:1.01.03-SNAPSHOT
	at org.apache.maven.project.DefaultProjectDependenciesResolver.resolve(DefaultProjectDependenciesResolver.java:189)
	at org.apache.maven.lifecycle.internal.LifecycleDependencyResolver.getDependencies(LifecycleDependencyResolver.java:185)
	... 22 more
Caused by: org.sonatype.aether.resolution.DependencyResolutionException: Could not find artifact org.onehippo.cms7:hippo-cms7-utilities:jar:1.01.03-SNAPSHOT
	at org.sonatype.aether.impl.internal.DefaultRepositorySystem.resolveDependencies(DefaultRepositorySystem.java:375)
	at org.apache.maven.project.DefaultProjectDependenciesResolver.resolve(DefaultProjectDependenciesResolver.java:183)
	... 23 more
Caused by: org.sonatype.aether.resolution.ArtifactResolutionException: Could not find artifact org.onehippo.cms7:hippo-cms7-utilities:jar:1.01.03-SNAPSHOT
	at org.sonatype.aether.impl.internal.DefaultArtifactResolver.resolve(DefaultArtifactResolver.java:538)
	at org.sonatype.aether.impl.internal.DefaultArtifactResolver.resolveArtifacts(DefaultArtifactResolver.java:216)
	at org.sonatype.aether.impl.internal.DefaultRepositorySystem.resolveDependencies(DefaultRepositorySystem.java:358)
	... 24 more
Caused by: org.sonatype.aether.transfer.ArtifactNotFoundException: Could not find artifact org.onehippo.cms7:hippo-cms7-utilities:jar:1.01.03-SNAPSHOT
	at org.sonatype.aether.impl.internal.DefaultArtifactResolver.resolve(DefaultArtifactResolver.java:528)
	... 26 more
[ERROR] 
[ERROR] Re-run Maven using the -X switch to enable full debug logging.
[ERROR] 
[ERROR] For more information about the errors and possible solutions, please read the following articles:
[ERROR] [Help 1] http://cwiki.apache.org/confluence/display/MAVEN/DependencyResolutionException
[ERROR] 
[ERROR] After correcting the problems, you can resume the build with the command
[ERROR]   mvn <goals> -rf :hippo-testsuite-components
Sonar analysis completed: FAILURE

--
This message is automatically generated by Hudson. 
For more information on Hudson, see: http://hudson-ci.org/


More information about the Hippo-cms7-dev mailing list