[Hippo-cms7-dev] [Hudson] Build failed in Hudson: hippo-packages-2.20.xx #192

Hippo Public Hudson Server beheer at onehippo.com
Sun Jan 6 13:52:08 CET 2013


See <https://builds.onehippo.org/job/hippo-packages-2.20.xx/192/>

------------------------------------------
[...truncated 790 lines...]
[INFO] 
[INFO] --- maven-source-plugin:2.1.2:jar (attach-sources) @ hippo-package-cms-resources ---
[INFO] META-INF already added, skipping
[INFO] META-INF/NOTICE already added, skipping
[INFO] META-INF/LICENSE already added, skipping
[INFO] META-INF/DEPENDENCIES already added, skipping
[INFO] Building jar: <https://builds.onehippo.org/job/hippo-packages-2.20.xx/ws/hippo-packages-2.20.xx/package-cms-resources/target/hippo-package-cms-resources-2.20.07-SNAPSHOT-sources.jar>
[INFO] META-INF already added, skipping
[INFO] META-INF/NOTICE already added, skipping
[INFO] META-INF/LICENSE already added, skipping
[INFO] META-INF/DEPENDENCIES already added, skipping
[INFO] 
[INFO] --- maven-install-plugin:2.3.1:install (default-install) @ hippo-package-cms-resources ---
[INFO] Installing <https://builds.onehippo.org/job/hippo-packages-2.20.xx/ws/hippo-packages-2.20.xx/package-cms-resources/target/hippo-package-cms-resources-2.20.07-SNAPSHOT.war> to /var/hudson-data/repository/m2/org/onehippo/cms7/hippo-package-cms-resources/2.20.07-SNAPSHOT/hippo-package-cms-resources-2.20.07-SNAPSHOT.war
[INFO] Installing <https://builds.onehippo.org/job/hippo-packages-2.20.xx/ws/hippo-packages-2.20.xx/package-cms-resources/pom.xml> to /var/hudson-data/repository/m2/org/onehippo/cms7/hippo-package-cms-resources/2.20.07-SNAPSHOT/hippo-package-cms-resources-2.20.07-SNAPSHOT.pom
[INFO] Installing <https://builds.onehippo.org/job/hippo-packages-2.20.xx/ws/hippo-packages-2.20.xx/package-cms-resources/target/hippo-package-cms-resources-2.20.07-SNAPSHOT-sources.jar> to /var/hudson-data/repository/m2/org/onehippo/cms7/hippo-package-cms-resources/2.20.07-SNAPSHOT/hippo-package-cms-resources-2.20.07-SNAPSHOT-sources.jar
projectSucceeded org.onehippo.cms7:hippo-package-cms-resources:2.20.07-SNAPSHOT
[HUDSON] Archiving <https://builds.onehippo.org/job/hippo-packages-2.20.xx/ws/hippo-packages-2.20.xx/package-cms-resources/target/hippo-package-cms-resources-2.20.07-SNAPSHOT-sources.jar> to /var/hudson-data/jobs/hippo-packages-2.20.xx/modules/org.onehippo.cms7$hippo-package-cms-resources/builds/2013-01-06_13-49-49/archive/org.onehippo.cms7/hippo-package-cms-resources/2.20.07-SNAPSHOT/hippo-package-cms-resources-2.20.07-SNAPSHOT-sources.jar
[INFO]                                                                         
[INFO] ------------------------------------------------------------------------
[INFO] Building Hippo Package CMS WAR 2.20.07-SNAPSHOT
[INFO] ------------------------------------------------------------------------
[INFO] 
[INFO] --- maven-clean-plugin:2.4.1:clean (default-clean) @ hippo-package-cms-war ---
[INFO] [INFO] Checking for local modifications: skipped.
[INFO] Updating project files from SCM: skipped.
[INFO] Executing: /bin/sh -c cd <https://builds.onehippo.org/job/hippo-packages-2.20.xx/ws/hippo-packages-2.20.xx/package-cms-war> && svn --non-interactive info
[INFO] Working directory: <https://builds.onehippo.org/job/hippo-packages-2.20.xx/ws/hippo-packages-2.20.xx/package-cms-war>
[INFO] Storing buildNumber: 37652 at timestamp: 1357476658602
[INFO] Executing: /bin/sh -c cd <https://builds.onehippo.org/job/hippo-packages-2.20.xx/ws/hippo-packages-2.20.xx/package-cms-war> && svn --non-interactive info
[INFO] Working directory: <https://builds.onehippo.org/job/hippo-packages-2.20.xx/ws/hippo-packages-2.20.xx/package-cms-war>
[INFO] Storing buildScmBranch: branches/hippo-packages-2.20.xx/package-cms-war

[INFO] --- buildnumber-maven-plugin:1.0:create (default) @ hippo-package-cms-war ---
[INFO] 
[INFO] --- maven-remote-resources-plugin:1.2.1:process (default) @ hippo-package-cms-war ---
[INFO] [debug] execute contextualize
[INFO] Using 'UTF-8' encoding to copy filtered resources.
[INFO] Copying 0 resource
[INFO] Copying 3 resources

[INFO] --- maven-resources-plugin:2.5:resources (default-resources) @ hippo-package-cms-war ---
[INFO] [INFO] No sources to compile

[INFO] --- maven-compiler-plugin:2.3.2:compile (default-compile) @ hippo-package-cms-war ---
[INFO] [debug] execute contextualize
[INFO] Using 'UTF-8' encoding to copy filtered resources.
[INFO] skip non existing resourceDirectory <https://builds.onehippo.org/job/hippo-packages-2.20.xx/ws/hippo-packages-2.20.xx/package-cms-war/src/test/resources>
[INFO] Copying 3 resources

[INFO] --- maven-resources-plugin:2.5:testResources (default-testResources) @ hippo-package-cms-war ---
[INFO] [INFO] No sources to compile

[INFO] --- maven-compiler-plugin:2.3.2:testCompile (default-testCompile) @ hippo-package-cms-war ---
[INFO] [INFO] Surefire report directory: <https://builds.onehippo.org/job/hippo-packages-2.20.xx/ws/hippo-packages-2.20.xx/package-cms-war/target/surefire-reports>

-------------------------------------------------------
 T E S T S
-------------------------------------------------------

[INFO] --- maven-surefire-plugin:2.9:test (default-test) @ hippo-package-cms-war ---

Results :

Tests run: 0, Failures: 0, Errors: 0, Skipped: 0

[HUDSON] Recording test results
[INFO] Packaging webapp
[INFO] Assembling webapp [hippo-package-cms-war] in [<https://builds.onehippo.org/job/hippo-packages-2.20.xx/ws/hippo-packages-2.20.xx/package-cms-war/target/hippo-package-cms-war-2.20.07-SNAPSHOT]>
[INFO] Processing war project
[INFO] Copying webapp resources [<https://builds.onehippo.org/job/hippo-packages-2.20.xx/ws/hippo-packages-2.20.xx/package-cms-war/src/main/webapp]>
[INFO] 
[INFO] --- maven-war-plugin:2.1.1:war (default-war) @ hippo-package-cms-war ---
[INFO] Processing overlay [ id org.onehippo.cms7:hippo-package-cms-resources]
[INFO] Webapp assembled in [26440 msecs]
[INFO] Building war: <https://builds.onehippo.org/job/hippo-packages-2.20.xx/ws/hippo-packages-2.20.xx/package-cms-war/target/hippo-package-cms-war-2.20.07-SNAPSHOT.war>
[INFO] WEB-INF/web.xml already added, skipping
mojo forkStarted org.apache.maven.plugins:maven-source-plugin:2.1.2(attach-sources)
forkedProjectStarted org.onehippo.cms7:hippo-package-cms-war2.20.07-SNAPSHOT
[INFO] 
[INFO] --- buildnumber-maven-plugin:1.0:create (default) @ hippo-package-cms-war ---
[INFO] Checking for local modifications: skipped.
[INFO] Updating project files from SCM: skipped.
[INFO] Executing: /bin/sh -c cd <https://builds.onehippo.org/job/hippo-packages-2.20.xx/ws/hippo-packages-2.20.xx/package-cms-war> && svn --non-interactive info
[INFO] Working directory: <https://builds.onehippo.org/job/hippo-packages-2.20.xx/ws/hippo-packages-2.20.xx/package-cms-war>
[INFO] Storing buildNumber: 37652 at timestamp: 1357476701322
[INFO] Executing: /bin/sh -c cd <https://builds.onehippo.org/job/hippo-packages-2.20.xx/ws/hippo-packages-2.20.xx/package-cms-war> && svn --non-interactive info
[INFO] Working directory: <https://builds.onehippo.org/job/hippo-packages-2.20.xx/ws/hippo-packages-2.20.xx/package-cms-war>
[INFO] Storing buildScmBranch: branches/hippo-packages-2.20.xx/package-cms-war
forkedProjectSucceeded org.onehippo.cms7:hippo-package-cms-war2.20.07-SNAPSHOT
[HUDSON] Archiving <https://builds.onehippo.org/job/hippo-packages-2.20.xx/ws/hippo-packages-2.20.xx/package-cms-war/pom.xml> to /var/hudson-data/jobs/hippo-packages-2.20.xx/modules/org.onehippo.cms7$hippo-package-cms-war/builds/2013-01-06_13-49-49/archive/org.onehippo.cms7/hippo-package-cms-war/2.20.07-SNAPSHOT/pom.xml
[HUDSON] Archiving <https://builds.onehippo.org/job/hippo-packages-2.20.xx/ws/hippo-packages-2.20.xx/package-cms-war/target/hippo-package-cms-war-2.20.07-SNAPSHOT.war> to /var/hudson-data/jobs/hippo-packages-2.20.xx/modules/org.onehippo.cms7$hippo-package-cms-war/builds/2013-01-06_13-49-49/archive/org.onehippo.cms7/hippo-package-cms-war/2.20.07-SNAPSHOT/hippo-package-cms-war-2.20.07-SNAPSHOT.war
mojo forkSucceeded org.apache.maven.plugins:maven-source-plugin:2.1.2(attach-sources)
ignoring exception during new ExecutedMojo null
[INFO] 
[INFO] --- maven-source-plugin:2.1.2:jar (attach-sources) @ hippo-package-cms-war ---
[INFO] META-INF already added, skipping
[INFO] META-INF/NOTICE already added, skipping
[INFO] META-INF/LICENSE already added, skipping
[INFO] META-INF/DEPENDENCIES already added, skipping
[INFO] Building jar: <https://builds.onehippo.org/job/hippo-packages-2.20.xx/ws/hippo-packages-2.20.xx/package-cms-war/target/hippo-package-cms-war-2.20.07-SNAPSHOT-sources.jar>
[INFO] META-INF already added, skipping
[INFO] META-INF/NOTICE already added, skipping
[INFO] META-INF/LICENSE already added, skipping
[INFO] META-INF/DEPENDENCIES already added, skipping
[INFO] [INFO] Installing <https://builds.onehippo.org/job/hippo-packages-2.20.xx/ws/hippo-packages-2.20.xx/package-cms-war/target/hippo-package-cms-war-2.20.07-SNAPSHOT.war> to /var/hudson-data/repository/m2/org/onehippo/cms7/hippo-package-cms-war/2.20.07-SNAPSHOT/hippo-package-cms-war-2.20.07-SNAPSHOT.war

[INFO] --- maven-install-plugin:2.3.1:install (default-install) @ hippo-package-cms-war ---
[INFO] Installing <https://builds.onehippo.org/job/hippo-packages-2.20.xx/ws/hippo-packages-2.20.xx/package-cms-war/pom.xml> to /var/hudson-data/repository/m2/org/onehippo/cms7/hippo-package-cms-war/2.20.07-SNAPSHOT/hippo-package-cms-war-2.20.07-SNAPSHOT.pom
[INFO] Installing <https://builds.onehippo.org/job/hippo-packages-2.20.xx/ws/hippo-packages-2.20.xx/package-cms-war/target/hippo-package-cms-war-2.20.07-SNAPSHOT-sources.jar> to /var/hudson-data/repository/m2/org/onehippo/cms7/hippo-package-cms-war/2.20.07-SNAPSHOT/hippo-package-cms-war-2.20.07-SNAPSHOT-sources.jar
projectSucceeded org.onehippo.cms7:hippo-package-cms-war:2.20.07-SNAPSHOT
[HUDSON] Archiving <https://builds.onehippo.org/job/hippo-packages-2.20.xx/ws/hippo-packages-2.20.xx/package-cms-war/target/hippo-package-cms-war-2.20.07-SNAPSHOT-sources.jar> to /var/hudson-data/jobs/hippo-packages-2.20.xx/modules/org.onehippo.cms7$hippo-package-cms-war/builds/2013-01-06_13-49-49/archive/org.onehippo.cms7/hippo-package-cms-war/2.20.07-SNAPSHOT/hippo-package-cms-war-2.20.07-SNAPSHOT-sources.jar
sessionEnded
[INFO] ------------------------------------------------------------------------
[INFO] Reactor Summary:
[INFO] 
[INFO] Hippo Product Packages ............................ SUCCESS [2.040s]
[INFO] Hippo Dependencies Package Applications ........... SUCCESS [8.840s]
[INFO] Hippo Package CMS Dependencies .................... SUCCESS [8.936s]
[INFO] Hippo Package CMS EAR ............................. SUCCESS [24.936s]
[INFO] Hippo Package CMS Resources ....................... SUCCESS [18.304s]
[INFO] Hippo Package CMS WAR ............................. SUCCESS [1:03.260s]
[INFO] ------------------------------------------------------------------------
[INFO] BUILD SUCCESS
[INFO] ------------------------------------------------------------------------
[INFO] Total time: 2:10.220s
[INFO] Finished at: Sun Jan 06 13:52:02 CET 2013
[INFO] Final Memory: 14M/42M
[INFO] ------------------------------------------------------------------------
maven builder waiting
channel stopped
[hippo-packages-2.20.xx] $ /home/hudson/software/maven/apache-maven-3.0-latest/bin/mvn -e -DskipTests deploy
[INFO] Error stacktraces are turned on.
[INFO] Scanning for projects...
[WARNING] 
[WARNING] Some problems were encountered while building the effective model for org.onehippo.cms7:hippo-package-cms-ear:ear:2.20.07-SNAPSHOT
[WARNING] 'dependencies.dependency.(groupId:artifactId:type:classifier)' must be unique: org.onehippo.cms7:hippo-cms-reporting:jar -> duplicate declaration of version ${hippo.cms.version} @ line 181, column 17
[WARNING] 
[WARNING] It is highly recommended to fix these problems because they threaten the stability of your build.
[WARNING] 
[WARNING] For this reason, future Maven versions might no longer support building such malformed projects.
[WARNING] 
[INFO] ------------------------------------------------------------------------
[INFO] Reactor Build Order:
[INFO] 
[INFO] Hippo Product Packages
[INFO] Hippo Dependencies Package Applications
[INFO] Hippo Package CMS Dependencies
[INFO] Hippo Package CMS EAR
[INFO] Hippo Package CMS Resources
[INFO] Hippo Package CMS WAR
[INFO]                                                                         
[INFO] ------------------------------------------------------------------------
[INFO] Building Hippo Product Packages 2.20.07-SNAPSHOT
[INFO] ------------------------------------------------------------------------
[INFO] 
[INFO] --- maven-remote-resources-plugin:1.2.1:process (default) @ hippo-packages ---
[INFO] 
[INFO] >>> maven-source-plugin:2.1.2:jar (attach-sources) @ hippo-packages >>>
[INFO] 
[INFO] <<< maven-source-plugin:2.1.2:jar (attach-sources) @ hippo-packages <<<
[INFO] 
[INFO] --- maven-source-plugin:2.1.2:jar (attach-sources) @ hippo-packages ---
[INFO] 
[INFO] --- maven-install-plugin:2.3.1:install (default-install) @ hippo-packages ---
[INFO] Installing <https://builds.onehippo.org/job/hippo-packages-2.20.xx/ws/hippo-packages-2.20.xx/pom.xml> to /var/hudson-data/repository/m2/org/onehippo/cms7/hippo-packages/2.20.07-SNAPSHOT/hippo-packages-2.20.07-SNAPSHOT.pom
[INFO] 
[INFO] --- maven-deploy-plugin:2.6:deploy (default-deploy) @ hippo-packages ---
Downloading: https://maven.onehippo.com/content/repositories/enterprise-snapshots/org/onehippo/cms7/hippo-packages/2.20.07-SNAPSHOT/maven-metadata.xml
Jan 6, 2013 1:52:07 PM org.apache.commons.httpclient.auth.AuthChallengeProcessor selectAuthScheme
INFO: basic authentication scheme selected
Jan 6, 2013 1:52:07 PM org.apache.commons.httpclient.HttpMethodDirector processWWWAuthChallenge
INFO: No credentials available for BASIC 'Sonatype Nexus Repository Manager'@maven.onehippo.com:443

[WARNING] Could not transfer metadata org.onehippo.cms7:hippo-packages:2.20.07-SNAPSHOT/maven-metadata.xml from/to hippo-maven2-enterprise-snapshots (https://maven.onehippo.com/content/repositories/enterprise-snapshots/): Not authorized.
[INFO] ------------------------------------------------------------------------
[INFO] Reactor Summary:
[INFO] 
[INFO] Hippo Product Packages ............................ FAILURE [1.828s]
[INFO] Hippo Dependencies Package Applications ........... SKIPPED
[INFO] Hippo Package CMS Dependencies .................... SKIPPED
[INFO] Hippo Package CMS EAR ............................. SKIPPED
[INFO] Hippo Package CMS Resources ....................... SKIPPED
[INFO] Hippo Package CMS WAR ............................. SKIPPED
[INFO] ------------------------------------------------------------------------
[INFO] BUILD FAILURE
[INFO] ------------------------------------------------------------------------
[INFO] Total time: 2.276s
[INFO] Finished at: Sun Jan 06 13:52:07 CET 2013
[INFO] Final Memory: 8M/20M
[INFO] ------------------------------------------------------------------------
[ERROR] Failed to execute goal org.apache.maven.plugins:maven-deploy-plugin:2.6:deploy (default-deploy) on project hippo-packages: Failed to retrieve remote metadata org.onehippo.cms7:hippo-packages:2.20.07-SNAPSHOT/maven-metadata.xml: Could not transfer metadata org.onehippo.cms7:hippo-packages:2.20.07-SNAPSHOT/maven-metadata.xml from/to hippo-maven2-enterprise-snapshots (https://maven.onehippo.com/content/repositories/enterprise-snapshots/): Not authorized. -> [Help 1]
org.apache.maven.lifecycle.LifecycleExecutionException: Failed to execute goal org.apache.maven.plugins:maven-deploy-plugin:2.6:deploy (default-deploy) on project hippo-packages: Failed to retrieve remote metadata org.onehippo.cms7:hippo-packages:2.20.07-SNAPSHOT/maven-metadata.xml: Could not transfer metadata org.onehippo.cms7:hippo-packages:2.20.07-SNAPSHOT/maven-metadata.xml from/to hippo-maven2-enterprise-snapshots (https://maven.onehippo.com/content/repositories/enterprise-snapshots/): Not authorized.
	at org.apache.maven.lifecycle.internal.MojoExecutor.execute(MojoExecutor.java:217)
	at org.apache.maven.lifecycle.internal.MojoExecutor.execute(MojoExecutor.java:153)
	at org.apache.maven.lifecycle.internal.MojoExecutor.execute(MojoExecutor.java:145)
	at org.apache.maven.lifecycle.internal.LifecycleModuleBuilder.buildProject(LifecycleModuleBuilder.java:84)
	at org.apache.maven.lifecycle.internal.LifecycleModuleBuilder.buildProject(LifecycleModuleBuilder.java:59)
	at org.apache.maven.lifecycle.internal.LifecycleStarter.singleThreadedBuild(LifecycleStarter.java:183)
	at org.apache.maven.lifecycle.internal.LifecycleStarter.execute(LifecycleStarter.java:161)
	at org.apache.maven.DefaultMaven.doExecute(DefaultMaven.java:320)
	at org.apache.maven.DefaultMaven.execute(DefaultMaven.java:156)
	at org.apache.maven.cli.MavenCli.execute(MavenCli.java:537)
	at org.apache.maven.cli.MavenCli.doMain(MavenCli.java:196)
	at org.apache.maven.cli.MavenCli.main(MavenCli.java:141)
	at sun.reflect.NativeMethodAccessorImpl.invoke0(Native Method)
	at sun.reflect.NativeMethodAccessorImpl.invoke(NativeMethodAccessorImpl.java:39)
	at sun.reflect.DelegatingMethodAccessorImpl.invoke(DelegatingMethodAccessorImpl.java:25)
	at java.lang.reflect.Method.invoke(Method.java:597)
	at org.codehaus.plexus.classworlds.launcher.Launcher.launchEnhanced(Launcher.java:290)
	at org.codehaus.plexus.classworlds.launcher.Launcher.launch(Launcher.java:230)
	at org.codehaus.plexus.classworlds.launcher.Launcher.mainWithExitCode(Launcher.java:409)
	at org.codehaus.plexus.classworlds.launcher.Launcher.main(Launcher.java:352)
Caused by: org.apache.maven.plugin.MojoExecutionException: Failed to retrieve remote metadata org.onehippo.cms7:hippo-packages:2.20.07-SNAPSHOT/maven-metadata.xml: Could not transfer metadata org.onehippo.cms7:hippo-packages:2.20.07-SNAPSHOT/maven-metadata.xml from/to hippo-maven2-enterprise-snapshots (https://maven.onehippo.com/content/repositories/enterprise-snapshots/): Not authorized.
	at org.apache.maven.plugin.deploy.DeployMojo.execute(DeployMojo.java:192)
	at org.apache.maven.plugin.DefaultBuildPluginManager.executeMojo(DefaultBuildPluginManager.java:101)
	at org.apache.maven.lifecycle.internal.MojoExecutor.execute(MojoExecutor.java:209)
	... 19 more
Caused by: org.apache.maven.artifact.deployer.ArtifactDeploymentException: Failed to retrieve remote metadata org.onehippo.cms7:hippo-packages:2.20.07-SNAPSHOT/maven-metadata.xml: Could not transfer metadata org.onehippo.cms7:hippo-packages:2.20.07-SNAPSHOT/maven-metadata.xml from/to hippo-maven2-enterprise-snapshots (https://maven.onehippo.com/content/repositories/enterprise-snapshots/): Not authorized.
	at org.apache.maven.artifact.deployer.DefaultArtifactDeployer.deploy(DefaultArtifactDeployer.java:141)
	at org.apache.maven.plugin.deploy.DeployMojo.execute(DeployMojo.java:148)
	... 21 more
Caused by: org.sonatype.aether.deployment.DeploymentException: Failed to retrieve remote metadata org.onehippo.cms7:hippo-packages:2.20.07-SNAPSHOT/maven-metadata.xml: Could not transfer metadata org.onehippo.cms7:hippo-packages:2.20.07-SNAPSHOT/maven-metadata.xml from/to hippo-maven2-enterprise-snapshots (https://maven.onehippo.com/content/repositories/enterprise-snapshots/): Not authorized.
	at org.sonatype.aether.impl.internal.DefaultDeployer.upload(DefaultDeployer.java:403)
	at org.sonatype.aether.impl.internal.DefaultDeployer.deploy(DefaultDeployer.java:256)
	at org.sonatype.aether.impl.internal.DefaultDeployer.deploy(DefaultDeployer.java:211)
	at org.sonatype.aether.impl.internal.DefaultRepositorySystem.deploy(DefaultRepositorySystem.java:443)
	at org.apache.maven.artifact.deployer.DefaultArtifactDeployer.deploy(DefaultArtifactDeployer.java:137)
	... 22 more
Caused by: org.sonatype.aether.transfer.MetadataTransferException: Could not transfer metadata org.onehippo.cms7:hippo-packages:2.20.07-SNAPSHOT/maven-metadata.xml from/to hippo-maven2-enterprise-snapshots (https://maven.onehippo.com/content/repositories/enterprise-snapshots/): Not authorized.
	at org.sonatype.aether.connector.wagon.WagonRepositoryConnector$3.wrap(WagonRepositoryConnector.java:930)
	at org.sonatype.aether.connector.wagon.WagonRepositoryConnector$3.wrap(WagonRepositoryConnector.java:920)
	at org.sonatype.aether.connector.wagon.WagonRepositoryConnector$GetTask.run(WagonRepositoryConnector.java:669)
	at org.sonatype.aether.util.concurrency.RunnableErrorForwarder$1.run(RunnableErrorForwarder.java:60)
	at java.util.concurrent.ThreadPoolExecutor$Worker.runTask(ThreadPoolExecutor.java:886)
	at java.util.concurrent.ThreadPoolExecutor$Worker.run(ThreadPoolExecutor.java:908)
	at java.lang.Thread.run(Thread.java:662)
Caused by: org.apache.maven.wagon.authorization.AuthorizationException: Not authorized.
	at org.apache.maven.wagon.shared.http.AbstractHttpClientWagon.fillInputData(AbstractHttpClientWagon.java:596)
	at org.apache.maven.wagon.StreamWagon.getInputStream(StreamWagon.java:116)
	at org.apache.maven.wagon.StreamWagon.getIfNewer(StreamWagon.java:88)
	at org.apache.maven.wagon.StreamWagon.get(StreamWagon.java:61)
	at org.sonatype.aether.connector.wagon.WagonRepositoryConnector$GetTask.run(WagonRepositoryConnector.java:601)
	... 4 more
[ERROR] 
[ERROR] Re-run Maven using the -X switch to enable full debug logging.
[ERROR] 
[ERROR] For more information about the errors and possible solutions, please read the following articles:
[ERROR] [Help 1] http://cwiki.apache.org/confluence/display/MAVEN/MojoExecutionException

--
This message is automatically generated by Hudson. 
For more information on Hudson, see: http://hudson-ci.org/


More information about the Hippo-cms7-dev mailing list