[Hippo-cms7-dev] [Hudson] Build failed in Hudson: hippo-cms Trunk #2237

Hippo Public Hudson Server beheer at onehippo.com
Sun Jan 6 14:31:04 CET 2013


See <https://builds.onehippo.org/job/hippo-cms%20Trunk/2237/changes>

Changes:

[Ard Schrijvers] CMS7-6792 copyright header files

------------------------------------------
[...truncated 9148 lines...]
[INFO] Installing <https://builds.onehippo.org/job/hippo-cms%20Trunk/ws/editor/common/pom.xml> to /var/hudson-data/repository/m2/org/onehippo/cms7/hippo-cms-editor-common/2.24.01-SNAPSHOT/hippo-cms-editor-common-2.24.01-SNAPSHOT.pom
[INFO] Installing <https://builds.onehippo.org/job/hippo-cms%20Trunk/ws/editor/common/target/hippo-cms-editor-common-2.24.01-SNAPSHOT-sources.jar> to /var/hudson-data/repository/m2/org/onehippo/cms7/hippo-cms-editor-common/2.24.01-SNAPSHOT/hippo-cms-editor-common-2.24.01-SNAPSHOT-sources.jar
projectSucceeded org.onehippo.cms7:hippo-cms-editor-common:2.24.01-SNAPSHOT
[HUDSON] Archiving <https://builds.onehippo.org/job/hippo-cms%20Trunk/ws/editor/common/pom.xml> to /var/hudson-data/jobs/hippo-cms Trunk/modules/org.onehippo.cms7$hippo-cms-editor-common/builds/2013-01-06_14-27-06/archive/org.onehippo.cms7/hippo-cms-editor-common/2.24.01-SNAPSHOT/pom.xml
[HUDSON] Archiving <https://builds.onehippo.org/job/hippo-cms%20Trunk/ws/editor/common/target/hippo-cms-editor-common-2.24.01-SNAPSHOT.jar> to /var/hudson-data/jobs/hippo-cms Trunk/modules/org.onehippo.cms7$hippo-cms-editor-common/builds/2013-01-06_14-27-06/archive/org.onehippo.cms7/hippo-cms-editor-common/2.24.01-SNAPSHOT/hippo-cms-editor-common-2.24.01-SNAPSHOT.jar
[HUDSON] Archiving <https://builds.onehippo.org/job/hippo-cms%20Trunk/ws/editor/common/target/hippo-cms-editor-common-2.24.01-SNAPSHOT-sources.jar> to /var/hudson-data/jobs/hippo-cms Trunk/modules/org.onehippo.cms7$hippo-cms-editor-common/builds/2013-01-06_14-27-06/archive/org.onehippo.cms7/hippo-cms-editor-common/2.24.01-SNAPSHOT/hippo-cms-editor-common-2.24.01-SNAPSHOT-sources.jar
[INFO]                                                                         
[INFO] ------------------------------------------------------------------------
[INFO] Building CMS Translation Repository 2.24.01-SNAPSHOT
[INFO] ------------------------------------------------------------------------
[INFO] 
[INFO] --- maven-clean-plugin:2.4.1:clean (default-clean) @ hippo-cms-translation-repository ---
[INFO] 
[INFO] --- maven-remote-resources-plugin:1.2.1:process (default) @ hippo-cms-translation-repository ---
[INFO] [INFO] Using 'UTF-8' encoding to copy filtered resources.
[INFO] Copying 11 resources
[INFO] Copying 3 resources

[INFO] --- maven-resources-plugin:2.6:resources (default-resources) @ hippo-cms-translation-repository ---
[INFO] 
[INFO] --- maven-compiler-plugin:2.3.2:compile (default-compile) @ hippo-cms-translation-repository ---
[INFO] Compiling 1 source file to <https://builds.onehippo.org/job/hippo-cms%20Trunk/ws/translation/repository/target/classes>
[INFO] 
[INFO] --- maven-resources-plugin:2.6:testResources (default-testResources) @ hippo-cms-translation-repository ---
[INFO] Using 'UTF-8' encoding to copy filtered resources.
[INFO] skip non existing resourceDirectory <https://builds.onehippo.org/job/hippo-cms%20Trunk/ws/translation/repository/src/test/resources>
[INFO] Copying 3 resources
[INFO] 
[INFO] --- maven-compiler-plugin:2.3.2:testCompile (default-testCompile) @ hippo-cms-translation-repository ---
[INFO] No sources to compile
[INFO] 
[INFO] --- maven-surefire-plugin:2.9:test (default-test) @ hippo-cms-translation-repository ---
[INFO] Surefire report directory: <https://builds.onehippo.org/job/hippo-cms%20Trunk/ws/translation/repository/target/surefire-reports>

-------------------------------------------------------
 T E S T S
-------------------------------------------------------

Results :

Tests run: 0, Failures: 0, Errors: 0, Skipped: 0

[HUDSON] Recording test results
[INFO] 
[INFO] --- maven-jar-plugin:2.3.1:jar (default-jar) @ hippo-cms-translation-repository ---
[INFO] Building jar: <https://builds.onehippo.org/job/hippo-cms%20Trunk/ws/translation/repository/target/hippo-cms-translation-repository-2.24.01-SNAPSHOT.jar>
mojo forkStarted org.apache.maven.plugins:maven-source-plugin:2.1.2(attach-sources)
mojo forkSucceeded org.apache.maven.plugins:maven-source-plugin:2.1.2(attach-sources)
ignoring exception during new ExecutedMojo null
[INFO] 
[INFO] --- maven-source-plugin:2.1.2:jar (attach-sources) @ hippo-cms-translation-repository ---
[INFO] META-INF already added, skipping
[INFO] META-INF/NOTICE already added, skipping
[INFO] META-INF/LICENSE already added, skipping
[INFO] META-INF/DEPENDENCIES already added, skipping
[INFO] Building jar: <https://builds.onehippo.org/job/hippo-cms%20Trunk/ws/translation/repository/target/hippo-cms-translation-repository-2.24.01-SNAPSHOT-sources.jar>
[INFO] META-INF already added, skipping
[INFO] META-INF/NOTICE already added, skipping
[INFO] META-INF/LICENSE already added, skipping
[INFO] META-INF/DEPENDENCIES already added, skipping
[INFO] 
[INFO] --- maven-install-plugin:2.3.1:install (default-install) @ hippo-cms-translation-repository ---
[INFO] Installing <https://builds.onehippo.org/job/hippo-cms%20Trunk/ws/translation/repository/target/hippo-cms-translation-repository-2.24.01-SNAPSHOT.jar> to /var/hudson-data/repository/m2/org/onehippo/cms7/hippo-cms-translation-repository/2.24.01-SNAPSHOT/hippo-cms-translation-repository-2.24.01-SNAPSHOT.jar
[INFO] Installing <https://builds.onehippo.org/job/hippo-cms%20Trunk/ws/translation/repository/pom.xml> to /var/hudson-data/repository/m2/org/onehippo/cms7/hippo-cms-translation-repository/2.24.01-SNAPSHOT/hippo-cms-translation-repository-2.24.01-SNAPSHOT.pom
[INFO] Installing <https://builds.onehippo.org/job/hippo-cms%20Trunk/ws/translation/repository/target/hippo-cms-translation-repository-2.24.01-SNAPSHOT-sources.jar> to /var/hudson-data/repository/m2/org/onehippo/cms7/hippo-cms-translation-repository/2.24.01-SNAPSHOT/hippo-cms-translation-repository-2.24.01-SNAPSHOT-sources.jar
projectSucceeded org.onehippo.cms7:hippo-cms-translation-repository:2.24.01-SNAPSHOT
[HUDSON] Archiving <https://builds.onehippo.org/job/hippo-cms%20Trunk/ws/translation/repository/pom.xml> to /var/hudson-data/jobs/hippo-cms Trunk/modules/org.onehippo.cms7$hippo-cms-translation-repository/builds/2013-01-06_14-27-06/archive/org.onehippo.cms7/hippo-cms-translation-repository/2.24.01-SNAPSHOT/pom.xml
[HUDSON] Archiving <https://builds.onehippo.org/job/hippo-cms%20Trunk/ws/translation/repository/target/hippo-cms-translation-repository-2.24.01-SNAPSHOT.jar> to /var/hudson-data/jobs/hippo-cms Trunk/modules/org.onehippo.cms7$hippo-cms-translation-repository/builds/2013-01-06_14-27-06/archive/org.onehippo.cms7/hippo-cms-translation-repository/2.24.01-SNAPSHOT/hippo-cms-translation-repository-2.24.01-SNAPSHOT.jar
[HUDSON] Archiving <https://builds.onehippo.org/job/hippo-cms%20Trunk/ws/translation/repository/target/hippo-cms-translation-repository-2.24.01-SNAPSHOT-sources.jar> to /var/hudson-data/jobs/hippo-cms Trunk/modules/org.onehippo.cms7$hippo-cms-translation-repository/builds/2013-01-06_14-27-06/archive/org.onehippo.cms7/hippo-cms-translation-repository/2.24.01-SNAPSHOT/hippo-cms-translation-repository-2.24.01-SNAPSHOT-sources.jar
[INFO]                                                                         
[INFO] ------------------------------------------------------------------------
[INFO] Building CMS Editor Repository 2.24.01-SNAPSHOT
[INFO] ------------------------------------------------------------------------
[INFO] 
[INFO] --- maven-clean-plugin:2.4.1:clean (default-clean) @ hippo-cms-editor-repository ---
[INFO] 
[INFO] --- maven-remote-resources-plugin:1.2.1:process (default) @ hippo-cms-editor-repository ---
[INFO] [INFO] Using 'UTF-8' encoding to copy filtered resources.
[INFO] Copying 43 resources

[INFO] --- maven-resources-plugin:2.6:resources (default-resources) @ hippo-cms-editor-repository ---
[INFO] Copying 3 resources
[INFO] 
[INFO] --- maven-compiler-plugin:2.3.2:compile (default-compile) @ hippo-cms-editor-repository ---
[INFO] Compiling 3 source files to <https://builds.onehippo.org/job/hippo-cms%20Trunk/ws/editor/repository/target/classes>
[INFO] 
[INFO] --- maven-datanucleus-plugin:2.2.1:enhance (default) @ hippo-cms-editor-repository ---
Downloading: http://maven.onehippo.com/maven2/org/datanucleus/datanucleus-enhancer/maven-metadata.xml
Downloading: http://repo.maven.apache.org/maven2/org/datanucleus/datanucleus-enhancer/maven-metadata.xml
Downloading: http://www.datanucleus.org/downloads/maven2/org/datanucleus/datanucleus-enhancer/maven-metadata.xml
Downloaded: http://www.datanucleus.org/downloads/maven2/org/datanucleus/datanucleus-enhancer/maven-metadata.xml (2 KB at 3.0 KB/sec)
Downloaded: http://repo.maven.apache.org/maven2/org/datanucleus/datanucleus-enhancer/maven-metadata.xml (2 KB at 2.5 KB/sec)
Downloading: http://repo.maven.apache.org/maven2/asm/asm/maven-metadata.xml
Downloading: http://maven.onehippo.com/maven2/asm/asm/maven-metadata.xml
Downloading: http://www.datanucleus.org/downloads/maven2/asm/asm/maven-metadata.xml
Downloaded: http://repo.maven.apache.org/maven2/asm/asm/maven-metadata.xml (898 B at 3.4 KB/sec)
[WARNING] Could not transfer metadata asm:asm/maven-metadata.xml from/to local.repository (file:../../local.repository/trunk): No connector available to access repository local.repository (file:../../local.repository/trunk) of type legacy using the available factories WagonRepositoryConnectorFactory
Downloading: http://maven.onehippo.com/maven2/javax/jdo/jdo-api/maven-metadata.xml
Downloading: http://repo.maven.apache.org/maven2/javax/jdo/jdo-api/maven-metadata.xml
Downloading: http://www.datanucleus.org/downloads/maven2/javax/jdo/jdo-api/maven-metadata.xml
[WARNING] Checksum validation failed, expected 30d3370ea2e1dd1094f4a5173c9323b0fc237eda but is 88f4027bee7304c0bdaeec91071aa7b187b0fedf for http://repo.maven.apache.org/maven2/javax/jdo/jdo-api/maven-metadata.xml
[WARNING] Checksum validation failed, expected 30d3370ea2e1dd1094f4a5173c9323b0fc237eda but is 88f4027bee7304c0bdaeec91071aa7b187b0fedf for http://repo.maven.apache.org/maven2/javax/jdo/jdo-api/maven-metadata.xml
Downloaded: http://repo.maven.apache.org/maven2/javax/jdo/jdo-api/maven-metadata.xml (323 B at 1.0 KB/sec)
Downloading: http://maven.onehippo.com/maven2/org/datanucleus/datanucleus-rdbms/maven-metadata.xml
Downloading: http://repo.maven.apache.org/maven2/org/datanucleus/datanucleus-rdbms/maven-metadata.xml
Downloading: http://www.datanucleus.org/downloads/maven2/org/datanucleus/datanucleus-rdbms/maven-metadata.xml
Downloaded: http://www.datanucleus.org/downloads/maven2/org/datanucleus/datanucleus-rdbms/maven-metadata.xml (3 KB at 7.9 KB/sec)
Downloaded: http://repo.maven.apache.org/maven2/org/datanucleus/datanucleus-rdbms/maven-metadata.xml (3 KB at 3.5 KB/sec)
Downloading: http://maven.onehippo.com/maven2/org/datanucleus/datanucleus-jpa/maven-metadata.xml
Downloading: http://repo.maven.apache.org/maven2/org/datanucleus/datanucleus-jpa/maven-metadata.xml
Downloading: http://www.datanucleus.org/downloads/maven2/org/datanucleus/datanucleus-jpa/maven-metadata.xml
Downloaded: http://www.datanucleus.org/downloads/maven2/org/datanucleus/datanucleus-jpa/maven-metadata.xml (2 KB at 2.9 KB/sec)
Downloaded: http://repo.maven.apache.org/maven2/org/datanucleus/datanucleus-jpa/maven-metadata.xml (2 KB at 1.7 KB/sec)
Downloading: http://www.datanucleus.org/downloads/maven2/org/onehippo/cms7/hippo-repository-api/2.24.02-SNAPSHOT/maven-metadata.xml
Downloading: http://www.datanucleus.org/downloads/maven2/org/onehippo/cms7/hippo-repository-api/2.24.02-SNAPSHOT/hippo-repository-api-2.24.02-SNAPSHOT.jar
mojoFailed org.datanucleus:maven-datanucleus-plugin:2.2.1(default)
ignoring exception during new ExecutedMojo null
projectFailed org.onehippo.cms7:hippo-cms-editor-repository:2.24.01-SNAPSHOT
[HUDSON] Archiving <https://builds.onehippo.org/job/hippo-cms%20Trunk/ws/editor/repository/pom.xml> to /var/hudson-data/jobs/hippo-cms Trunk/modules/org.onehippo.cms7$hippo-cms-editor-repository/builds/2013-01-06_14-27-06/archive/org.onehippo.cms7/hippo-cms-editor-repository/2.24.01-SNAPSHOT/pom.xml
sessionEnded
[INFO] ------------------------------------------------------------------------
[INFO] Reactor Summary:
[INFO] 
[INFO] CMS ............................................... SUCCESS [1.880s]
[INFO] CMS API ........................................... SUCCESS [34.132s]
[INFO] CMS Node Types .................................... SUCCESS [1.036s]
[INFO] CMS Engine ........................................ SUCCESS [6.976s]
[INFO] CMS Engine Test ................................... SUCCESS [2:02.752s]
[INFO] CMS Console ....................................... SUCCESS [0.308s]
[INFO] CMS Plugins ....................................... SUCCESS [5.780s]
[INFO] CMS Console configuration ......................... SUCCESS [0.784s]
[INFO] CMS Workflow Menu ................................. SUCCESS [1.868s]
[INFO] CMS Translation ................................... SUCCESS [0.264s]
[INFO] CMS Translation Common ............................ SUCCESS [1.208s]
[INFO] CMS Builtin ....................................... SUCCESS [2.712s]
[INFO] CMS Package Configuration ......................... SUCCESS [1.044s]
[INFO] CMS Editor ........................................ SUCCESS [0.272s]
[INFO] CMS Editor Common ................................. SUCCESS [1.428s]
[INFO] CMS Translation Repository ........................ SUCCESS [2.152s]
[INFO] CMS Editor Repository ............................. FAILURE [7.716s]
[INFO] CMS Editor Plugins ................................ SKIPPED
[INFO] CMS Editor Test ................................... SKIPPED
[INFO] CMS jQuery ........................................ SKIPPED
[INFO] CMS Gallery ....................................... SKIPPED
[INFO] CMS Gallery Repository ............................ SKIPPED
[INFO] CMS Gallery Plugins ............................... SKIPPED
[INFO] CMS Goto .......................................... SKIPPED
[INFO] CMS Perspectives .................................. SKIPPED
[INFO] CMS Reporting Dashboard ........................... SKIPPED
[INFO] CMS Reporting Frontend ............................ SKIPPED
[INFO] CMS Reporting Repository .......................... SKIPPED
[INFO] CMS Rich Text Editor .............................. SKIPPED
[INFO] CMS Rich Text Configuration ....................... SKIPPED
[INFO] CMS Rich Text Frontend ............................ SKIPPED
[INFO] CMS Rich Text Resources ........................... SKIPPED
[INFO] CMS Rich Text Test ................................ SKIPPED
[INFO] CMS Search ........................................ SKIPPED
[INFO] CMS Skin .......................................... SKIPPED
[INFO] CMS Surf .......................................... SKIPPED
[INFO] CMS Surf Frontend ................................. SKIPPED
[INFO] CMS Surf Repository ............................... SKIPPED
[INFO] CMS Translation Plugins ........................... SKIPPED
[INFO] CMS Translation Test .............................. SKIPPED
[INFO] CMS Versioning .................................... SKIPPED
[INFO] CMS Publication Workflow .......................... SKIPPED
[INFO] CMS Publication Workflow configuration ............ SKIPPED
[INFO] CMS Publication Workflow frontend ................. SKIPPED
[INFO] CMS Brokenlinks ................................... SKIPPED
[INFO] CMS Brokenlinks common ............................ SKIPPED
[INFO] CMS Shared Dependencies ........................... SKIPPED
[INFO] CMS Brokenlinks frontend .......................... SKIPPED
[INFO] CMS Automatic Export .............................. SKIPPED
[INFO] CMS Automatic Export Frontend ..................... SKIPPED
[INFO] CMS Dependencies .................................. SKIPPED
[INFO] CMS Brokenlinks repository ........................ SKIPPED
[INFO] CMS Automatic Export Repository ................... SKIPPED
[INFO] CMS Repository Dependencies ....................... SKIPPED
[INFO] CMS Brokenlinks test .............................. SKIPPED
[INFO] CMS Google Analytics .............................. SKIPPED
[INFO] CMS Google Analytics Frontend ..................... SKIPPED
[INFO] CMS Upgrade Modules ............................... SKIPPED
[INFO] CMS Tools ......................................... SKIPPED
[INFO] CMS Eclipse utilities ............................. SKIPPED
[INFO] CMS Development content ........................... SKIPPED
[INFO] CMS Upgrade utilities ............................. SKIPPED
[INFO] Translation runner ................................ SKIPPED
[INFO] ------------------------------------------------------------------------
[INFO] BUILD FAILURE
[INFO] ------------------------------------------------------------------------
[INFO] Total time: 3:19.352s
[INFO] Finished at: Sun Jan 06 14:30:29 CET 2013
[INFO] Final Memory: 41M/97M
[INFO] ------------------------------------------------------------------------
maven builder waiting
mavenExecutionResult exceptions not empty
org.apache.maven.lifecycle.LifecycleExecutionException: Failed to execute goal org.datanucleus:maven-datanucleus-plugin:2.2.1:enhance (default) on project hippo-cms-editor-repository: Execution default of goal org.datanucleus:maven-datanucleus-plugin:2.2.1:enhance failed: Plugin org.datanucleus:maven-datanucleus-plugin:2.2.1 or one of its dependencies could not be resolved: Could not find artifact org.onehippo.cms7:hippo-repository-api:jar:2.24.02-SNAPSHOT in DN_M2_Repo (http://www.datanucleus.org/downloads/maven2/)
	at org.apache.maven.lifecycle.internal.MojoExecutor.execute(MojoExecutor.java:225)
	at org.apache.maven.lifecycle.internal.MojoExecutor.execute(MojoExecutor.java:153)
	at org.apache.maven.lifecycle.internal.MojoExecutor.execute(MojoExecutor.java:145)
	at org.apache.maven.lifecycle.internal.LifecycleModuleBuilder.buildProject(LifecycleModuleBuilder.java:84)
	at org.apache.maven.lifecycle.internal.LifecycleModuleBuilder.buildProject(LifecycleModuleBuilder.java:59)
	at org.apache.maven.lifecycle.internal.LifecycleStarter.singleThreadedBuild(LifecycleStarter.java:183)
	at org.apache.maven.lifecycle.internal.LifecycleStarter.execute(LifecycleStarter.java:161)
	at org.apache.maven.DefaultMaven.doExecute(DefaultMaven.java:320)
	at org.apache.maven.DefaultMaven.execute(DefaultMaven.java:156)
	at org.jvnet.hudson.maven3.launcher.Maven3Launcher.main(Maven3Launcher.java:79)
	at sun.reflect.NativeMethodAccessorImpl.invoke0(Native Method)
	at sun.reflect.NativeMethodAccessorImpl.invoke(NativeMethodAccessorImpl.java:39)
	at sun.reflect.DelegatingMethodAccessorImpl.invoke(DelegatingMethodAccessorImpl.java:25)
	at java.lang.reflect.Method.invoke(Method.java:597)
	at org.codehaus.plexus.classworlds.launcher.Launcher.launchStandard(Launcher.java:329)
	at org.codehaus.plexus.classworlds.launcher.Launcher.launch(Launcher.java:239)
	at org.jvnet.hudson.maven3.agent.Maven3Main.launch(Maven3Main.java:146)
	at hudson.maven.Maven3Builder.call(Maven3Builder.java:124)
	at hudson.maven.Maven3Builder.call(Maven3Builder.java:71)
	at hudson.remoting.UserRequest.perform(UserRequest.java:107)
	at hudson.remoting.UserRequest.perform(UserRequest.java:41)
	at hudson.remoting.Request$2.run(Request.java:276)
	at java.util.concurrent.Executors$RunnableAdapter.call(Executors.java:441)
	at java.util.concurrent.FutureTask$Sync.innerRun(FutureTask.java:303)
	at java.util.concurrent.FutureTask.run(FutureTask.java:138)
	at java.util.concurrent.ThreadPoolExecutor$Worker.runTask(ThreadPoolExecutor.java:886)
	at java.util.concurrent.ThreadPoolExecutor$Worker.run(ThreadPoolExecutor.java:908)
	at java.lang.Thread.run(Thread.java:662)
Caused by: org.apache.maven.plugin.PluginExecutionException: Execution default of goal org.datanucleus:maven-datanucleus-plugin:2.2.1:enhance failed: Plugin org.datanucleus:maven-datanucleus-plugin:2.2.1 or one of its dependencies could not be resolved: Could not find artifact org.onehippo.cms7:hippo-repository-api:jar:2.24.02-SNAPSHOT in DN_M2_Repo (http://www.datanucleus.org/downloads/maven2/)
	at org.apache.maven.plugin.DefaultBuildPluginManager.executeMojo(DefaultBuildPluginManager.java:82)
	at org.apache.maven.lifecycle.internal.MojoExecutor.execute(MojoExecutor.java:209)
	... 27 more
Caused by: org.apache.maven.plugin.PluginResolutionException: Plugin org.datanucleus:maven-datanucleus-plugin:2.2.1 or one of its dependencies could not be resolved: Could not find artifact org.onehippo.cms7:hippo-repository-api:jar:2.24.02-SNAPSHOT in DN_M2_Repo (http://www.datanucleus.org/downloads/maven2/)
	at org.apache.maven.plugin.internal.DefaultPluginDependenciesResolver.resolve(DefaultPluginDependenciesResolver.java:215)
	at org.apache.maven.plugin.internal.DefaultMavenPluginManager.createPluginRealm(DefaultMavenPluginManager.java:353)
	at org.apache.maven.plugin.internal.DefaultMavenPluginManager.setupPluginRealm(DefaultMavenPluginManager.java:321)
	at org.apache.maven.plugin.DefaultBuildPluginManager.getPluginRealm(DefaultBuildPluginManager.java:175)
	at org.apache.maven.plugin.DefaultBuildPluginManager.executeMojo(DefaultBuildPluginManager.java:78)
	... 28 more
Caused by: org.sonatype.aether.resolution.ArtifactResolutionException: Could not find artifact org.onehippo.cms7:hippo-repository-api:jar:2.24.02-SNAPSHOT in DN_M2_Repo (http://www.datanucleus.org/downloads/maven2/)
	at org.sonatype.aether.impl.internal.DefaultArtifactResolver.resolve(DefaultArtifactResolver.java:538)
	at org.sonatype.aether.impl.internal.DefaultArtifactResolver.resolveArtifacts(DefaultArtifactResolver.java:216)
	at org.sonatype.aether.impl.internal.DefaultRepositorySystem.resolveDependencies(DefaultRepositorySystem.java:358)
	at org.apache.maven.plugin.internal.DefaultPluginDependenciesResolver.resolve(DefaultPluginDependenciesResolver.java:207)
	... 32 more
Caused by: org.sonatype.aether.transfer.ArtifactNotFoundException: Could not find artifact org.onehippo.cms7:hippo-repository-api:jar:2.24.02-SNAPSHOT in DN_M2_Repo (http://www.datanucleus.org/downloads/maven2/)
	at org.sonatype.aether.connector.wagon.WagonRepositoryConnector$4.wrap(WagonRepositoryConnector.java:947)
	at org.sonatype.aether.connector.wagon.WagonRepositoryConnector$4.wrap(WagonRepositoryConnector.java:941)
	at org.sonatype.aether.connector.wagon.WagonRepositoryConnector$GetTask.run(WagonRepositoryConnector.java:669)
	at org.sonatype.aether.util.concurrency.RunnableErrorForwarder$1.run(RunnableErrorForwarder.java:60)
	... 3 more
Sending e-mails to: hippo-cms7-dev at lists.onehippo.org
channel stopped

--
This message is automatically generated by Hudson. 
For more information on Hudson, see: http://hudson-ci.org/


More information about the Hippo-cms7-dev mailing list