[Hippo-cms7-dev] [Hudson] Build failed in Hudson: hippo-cms7-archetype Trunk #614

Hippo Public Hudson Server beheer at onehippo.com
Mon Jan 7 07:18:56 CET 2013


See <https://builds.onehippo.org/job/hippo-cms7-archetype%20Trunk/614/changes>

Changes:

[Ard Schrijvers] ARCHE-269 bump to latest snapshot release for 7.8.1-SNAPSHOT as the archetype starts lagging behind which makes it confusing for testing

------------------------------------------
[...truncated 1273 lines...]
     [java] [INFO] 
     [java] [INFO] <<< maven-source-plugin:2.1.2:jar (attach-sources) @ gettingstarted-bootstrap <<<
     [java] [INFO] 
     [java] [INFO] --- maven-source-plugin:2.1.2:jar (attach-sources) @ gettingstarted-bootstrap ---
     [java] [INFO] 
     [java] [INFO] --- maven-install-plugin:2.3.1:install (default-install) @ gettingstarted-bootstrap ---
     [java] [INFO] Installing <https://builds.onehippo.org/job/hippo-cms7-archetype%20Trunk/ws/trunk/website/target/gettingstarted/bootstrap/pom.xml> to /var/hudson-data/repository/m2/org/onehippo/cms7/hst/gettingstarted-bootstrap/1.01.00/gettingstarted-bootstrap-1.01.00.pom
     [java] [INFO]                                                                         
     [java] [INFO] ------------------------------------------------------------------------
     [java] [INFO] Building Getting Started Bootstrap Configuration 1.01.00
     [java] [INFO] ------------------------------------------------------------------------
     [java] [INFO] 
     [java] [INFO] --- buildnumber-maven-plugin:1.2:create (default) @ gettingstarted-bootstrap-configuration ---
     [java] [INFO] Checking for local modifications: skipped.
     [java] [INFO] Updating project files from SCM: skipped.
     [java] [INFO] Executing: /bin/sh -c cd "<https://builds.onehippo.org/job/hippo-cms7-archetype%20Trunk/ws/trunk/website/target/gettingstarted/bootstrap/configuration"> && svn --non-interactive info
     [java] [INFO] Working directory: <https://builds.onehippo.org/job/hippo-cms7-archetype%20Trunk/ws/trunk/website/target/gettingstarted/bootstrap/configuration>
     [java] [INFO] Storing buildNumber: -1 at timestamp: 1357539532210
     [java] [INFO] Executing: /bin/sh -c cd "<https://builds.onehippo.org/job/hippo-cms7-archetype%20Trunk/ws/trunk/website/target/gettingstarted/bootstrap/configuration"> && svn --non-interactive info
     [java] [INFO] Working directory: <https://builds.onehippo.org/job/hippo-cms7-archetype%20Trunk/ws/trunk/website/target/gettingstarted/bootstrap/configuration>
     [java] [INFO] Storing buildScmBranch: UNKNOWN_BRANCH
     [java] [INFO] 
     [java] [INFO] --- maven-remote-resources-plugin:1.2.1:process (default) @ gettingstarted-bootstrap-configuration ---
     [java] [INFO] 
     [java] [INFO] --- maven-resources-plugin:2.6:resources (default-resources) @ gettingstarted-bootstrap-configuration ---
     [java] [INFO] Using 'UTF-8' encoding to copy filtered resources.
     [java] [INFO] Copying 54 resources
     [java] [INFO] Copying 3 resources
     [java] [INFO] 
     [java] [INFO] --- maven-compiler-plugin:2.3.2:compile (default-compile) @ gettingstarted-bootstrap-configuration ---
     [java] [INFO] No sources to compile
     [java] [INFO] 
     [java] [INFO] --- maven-resources-plugin:2.6:testResources (default-testResources) @ gettingstarted-bootstrap-configuration ---
     [java] [INFO] Using 'UTF-8' encoding to copy filtered resources.
     [java] [INFO] skip non existing resourceDirectory <https://builds.onehippo.org/job/hippo-cms7-archetype%20Trunk/ws/trunk/website/target/gettingstarted/bootstrap/configuration/src/test/resources>
     [java] [INFO] Copying 3 resources
     [java] [INFO] 
     [java] [INFO] --- maven-compiler-plugin:2.3.2:testCompile (default-testCompile) @ gettingstarted-bootstrap-configuration ---
     [java] [INFO] No sources to compile
     [java] [INFO] 
     [java] [INFO] --- maven-surefire-plugin:2.9:test (default-test) @ gettingstarted-bootstrap-configuration ---
     [java] [INFO] Surefire report directory: <https://builds.onehippo.org/job/hippo-cms7-archetype%20Trunk/ws/trunk/website/target/gettingstarted/bootstrap/configuration/target/surefire-reports>

     [java] -------------------------------------------------------
     [java]  T E S T S
     [java] -------------------------------------------------------

     [java] Results :

     [java] Tests run: 0, Failures: 0, Errors: 0, Skipped: 0

     [java] [INFO] 
     [java] [INFO] --- maven-jar-plugin:2.3.1:jar (default-jar) @ gettingstarted-bootstrap-configuration ---
     [java] [INFO] Building jar: <https://builds.onehippo.org/job/hippo-cms7-archetype%20Trunk/ws/trunk/website/target/gettingstarted/bootstrap/configuration/target/gettingstarted-bootstrap-configuration-1.01.00.jar>
     [java] [INFO] 
     [java] [INFO] >>> maven-source-plugin:2.1.2:jar (attach-sources) @ gettingstarted-bootstrap-configuration >>>
     [java] [INFO] 
     [java] [INFO] --- buildnumber-maven-plugin:1.2:create (default) @ gettingstarted-bootstrap-configuration ---
     [java] [INFO] Checking for local modifications: skipped.
     [java] [INFO] Updating project files from SCM: skipped.
     [java] [INFO] Executing: /bin/sh -c cd "<https://builds.onehippo.org/job/hippo-cms7-archetype%20Trunk/ws/trunk/website/target/gettingstarted/bootstrap/configuration"> && svn --non-interactive info
     [java] [INFO] Working directory: <https://builds.onehippo.org/job/hippo-cms7-archetype%20Trunk/ws/trunk/website/target/gettingstarted/bootstrap/configuration>
     [java] [INFO] Storing buildNumber: -1 at timestamp: 1357539533262
     [java] [INFO] Executing: /bin/sh -c cd "<https://builds.onehippo.org/job/hippo-cms7-archetype%20Trunk/ws/trunk/website/target/gettingstarted/bootstrap/configuration"> && svn --non-interactive info
     [java] [INFO] Working directory: <https://builds.onehippo.org/job/hippo-cms7-archetype%20Trunk/ws/trunk/website/target/gettingstarted/bootstrap/configuration>
     [java] [INFO] Storing buildScmBranch: UNKNOWN_BRANCH
     [java] [INFO] 
     [java] [INFO] <<< maven-source-plugin:2.1.2:jar (attach-sources) @ gettingstarted-bootstrap-configuration <<<
     [java] [INFO] 
     [java] [INFO] --- maven-source-plugin:2.1.2:jar (attach-sources) @ gettingstarted-bootstrap-configuration ---
     [java] [INFO] META-INF already added, skipping
     [java] [INFO] META-INF/NOTICE already added, skipping
     [java] [INFO] META-INF/LICENSE already added, skipping
     [java] [INFO] META-INF/DEPENDENCIES already added, skipping
     [java] [INFO] Building jar: <https://builds.onehippo.org/job/hippo-cms7-archetype%20Trunk/ws/trunk/website/target/gettingstarted/bootstrap/configuration/target/gettingstarted-bootstrap-configuration-1.01.00-sources.jar>
     [java] [INFO] META-INF already added, skipping
     [java] [INFO] META-INF/NOTICE already added, skipping
     [java] [INFO] META-INF/LICENSE already added, skipping
     [java] [INFO] META-INF/DEPENDENCIES already added, skipping
     [java] [INFO] 
     [java] [INFO] --- maven-install-plugin:2.3.1:install (default-install) @ gettingstarted-bootstrap-configuration ---
     [java] [INFO] Installing <https://builds.onehippo.org/job/hippo-cms7-archetype%20Trunk/ws/trunk/website/target/gettingstarted/bootstrap/configuration/target/gettingstarted-bootstrap-configuration-1.01.00.jar> to /var/hudson-data/repository/m2/org/onehippo/cms7/hst/gettingstarted-bootstrap-configuration/1.01.00/gettingstarted-bootstrap-configuration-1.01.00.jar
     [java] [INFO] Installing <https://builds.onehippo.org/job/hippo-cms7-archetype%20Trunk/ws/trunk/website/target/gettingstarted/bootstrap/configuration/pom.xml> to /var/hudson-data/repository/m2/org/onehippo/cms7/hst/gettingstarted-bootstrap-configuration/1.01.00/gettingstarted-bootstrap-configuration-1.01.00.pom
     [java] [INFO] Installing <https://builds.onehippo.org/job/hippo-cms7-archetype%20Trunk/ws/trunk/website/target/gettingstarted/bootstrap/configuration/target/gettingstarted-bootstrap-configuration-1.01.00-sources.jar> to /var/hudson-data/repository/m2/org/onehippo/cms7/hst/gettingstarted-bootstrap-configuration/1.01.00/gettingstarted-bootstrap-configuration-1.01.00-sources.jar
     [java] [INFO]                                                                         
     [java] [INFO] ------------------------------------------------------------------------
     [java] [INFO] Building Getting Started Bootstrap Content 1.01.00
     [java] [INFO] ------------------------------------------------------------------------
     [java] [INFO] 
     [java] [INFO] --- buildnumber-maven-plugin:1.2:create (default) @ gettingstarted-bootstrap-content ---
     [java] [INFO] Checking for local modifications: skipped.
     [java] [INFO] Updating project files from SCM: skipped.
     [java] [INFO] Executing: /bin/sh -c cd "<https://builds.onehippo.org/job/hippo-cms7-archetype%20Trunk/ws/trunk/website/target/gettingstarted/bootstrap/content"> && svn --non-interactive info
     [java] [INFO] Working directory: <https://builds.onehippo.org/job/hippo-cms7-archetype%20Trunk/ws/trunk/website/target/gettingstarted/bootstrap/content>
     [java] [INFO] Storing buildNumber: -1 at timestamp: 1357539533846
     [java] [INFO] Executing: /bin/sh -c cd "<https://builds.onehippo.org/job/hippo-cms7-archetype%20Trunk/ws/trunk/website/target/gettingstarted/bootstrap/content"> && svn --non-interactive info
     [java] [INFO] Working directory: <https://builds.onehippo.org/job/hippo-cms7-archetype%20Trunk/ws/trunk/website/target/gettingstarted/bootstrap/content>
     [java] [INFO] Storing buildScmBranch: UNKNOWN_BRANCH
     [java] [INFO] 
     [java] [INFO] --- maven-remote-resources-plugin:1.2.1:process (default) @ gettingstarted-bootstrap-content ---
     [java] [INFO] 
     [java] [INFO] --- maven-resources-plugin:2.6:resources (default-resources) @ gettingstarted-bootstrap-content ---
     [java] [INFO] Using 'UTF-8' encoding to copy filtered resources.
     [java] [INFO] Copying 6 resources
     [java] [INFO] Copying 3 resources
     [java] [INFO] 
     [java] [INFO] --- maven-compiler-plugin:2.3.2:compile (default-compile) @ gettingstarted-bootstrap-content ---
     [java] [INFO] No sources to compile
     [java] [INFO] 
     [java] [INFO] --- maven-resources-plugin:2.6:testResources (default-testResources) @ gettingstarted-bootstrap-content ---
     [java] [INFO] Using 'UTF-8' encoding to copy filtered resources.
     [java] [INFO] skip non existing resourceDirectory <https://builds.onehippo.org/job/hippo-cms7-archetype%20Trunk/ws/trunk/website/target/gettingstarted/bootstrap/content/src/test/resources>
     [java] [INFO] Copying 3 resources
     [java] [INFO] 
     [java] [INFO] --- maven-compiler-plugin:2.3.2:testCompile (default-testCompile) @ gettingstarted-bootstrap-content ---
     [java] [INFO] No sources to compile
     [java] [INFO] 
     [java] [INFO] --- maven-surefire-plugin:2.9:test (default-test) @ gettingstarted-bootstrap-content ---
     [java] [INFO] Surefire report directory: <https://builds.onehippo.org/job/hippo-cms7-archetype%20Trunk/ws/trunk/website/target/gettingstarted/bootstrap/content/target/surefire-reports>

     [java] -------------------------------------------------------
     [java]  T E S T S
     [java] -------------------------------------------------------

     [java] Results :

     [java] Tests run: 0, Failures: 0, Errors: 0, Skipped: 0

     [java] [INFO] 
     [java] [INFO] --- maven-jar-plugin:2.3.1:jar (default-jar) @ gettingstarted-bootstrap-content ---
     [java] [INFO] Building jar: <https://builds.onehippo.org/job/hippo-cms7-archetype%20Trunk/ws/trunk/website/target/gettingstarted/bootstrap/content/target/gettingstarted-bootstrap-content-1.01.00.jar>
     [java] [INFO] 
     [java] [INFO] >>> maven-source-plugin:2.1.2:jar (attach-sources) @ gettingstarted-bootstrap-content >>>
     [java] [INFO] 
     [java] [INFO] --- buildnumber-maven-plugin:1.2:create (default) @ gettingstarted-bootstrap-content ---
     [java] [INFO] Checking for local modifications: skipped.
     [java] [INFO] Updating project files from SCM: skipped.
     [java] [INFO] Executing: /bin/sh -c cd "<https://builds.onehippo.org/job/hippo-cms7-archetype%20Trunk/ws/trunk/website/target/gettingstarted/bootstrap/content"> && svn --non-interactive info
     [java] [INFO] Working directory: <https://builds.onehippo.org/job/hippo-cms7-archetype%20Trunk/ws/trunk/website/target/gettingstarted/bootstrap/content>
     [java] [INFO] Storing buildNumber: -1 at timestamp: 1357539534214
     [java] [INFO] Executing: /bin/sh -c cd "<https://builds.onehippo.org/job/hippo-cms7-archetype%20Trunk/ws/trunk/website/target/gettingstarted/bootstrap/content"> && svn --non-interactive info
     [java] [INFO] Working directory: <https://builds.onehippo.org/job/hippo-cms7-archetype%20Trunk/ws/trunk/website/target/gettingstarted/bootstrap/content>
     [java] [INFO] Storing buildScmBranch: UNKNOWN_BRANCH
     [java] [INFO] 
     [java] [INFO] <<< maven-source-plugin:2.1.2:jar (attach-sources) @ gettingstarted-bootstrap-content <<<
     [java] [INFO] 
     [java] [INFO] --- maven-source-plugin:2.1.2:jar (attach-sources) @ gettingstarted-bootstrap-content ---
     [java] [INFO] META-INF already added, skipping
     [java] [INFO] META-INF/NOTICE already added, skipping
     [java] [INFO] META-INF/LICENSE already added, skipping
     [java] [INFO] META-INF/DEPENDENCIES already added, skipping
     [java] [INFO] Building jar: <https://builds.onehippo.org/job/hippo-cms7-archetype%20Trunk/ws/trunk/website/target/gettingstarted/bootstrap/content/target/gettingstarted-bootstrap-content-1.01.00-sources.jar>
     [java] [INFO] META-INF already added, skipping
     [java] [INFO] META-INF/NOTICE already added, skipping
     [java] [INFO] META-INF/LICENSE already added, skipping
     [java] [INFO] META-INF/DEPENDENCIES already added, skipping
     [java] [INFO] 
     [java] [INFO] --- maven-install-plugin:2.3.1:install (default-install) @ gettingstarted-bootstrap-content ---
     [java] [INFO] Installing <https://builds.onehippo.org/job/hippo-cms7-archetype%20Trunk/ws/trunk/website/target/gettingstarted/bootstrap/content/target/gettingstarted-bootstrap-content-1.01.00.jar> to /var/hudson-data/repository/m2/org/onehippo/cms7/hst/gettingstarted-bootstrap-content/1.01.00/gettingstarted-bootstrap-content-1.01.00.jar
     [java] [INFO] Installing <https://builds.onehippo.org/job/hippo-cms7-archetype%20Trunk/ws/trunk/website/target/gettingstarted/bootstrap/content/pom.xml> to /var/hudson-data/repository/m2/org/onehippo/cms7/hst/gettingstarted-bootstrap-content/1.01.00/gettingstarted-bootstrap-content-1.01.00.pom
     [java] [INFO] Installing <https://builds.onehippo.org/job/hippo-cms7-archetype%20Trunk/ws/trunk/website/target/gettingstarted/bootstrap/content/target/gettingstarted-bootstrap-content-1.01.00-sources.jar> to /var/hudson-data/repository/m2/org/onehippo/cms7/hst/gettingstarted-bootstrap-content/1.01.00/gettingstarted-bootstrap-content-1.01.00-sources.jar
     [java] [INFO]                                                                         
     [java] [INFO] ------------------------------------------------------------------------
     [java] [INFO] Building Getting Started CMS 1.01.00
     [java] [INFO] ------------------------------------------------------------------------
     [java] Downloading: http://maven.onehippo.com/maven2/org/onehippo/cms7/hippo-cms7-utilities/1.01.03-SNAPSHOT/hippo-cms7-utilities-1.01.03-SNAPSHOT.pom

     [java] [WARNING] The POM for org.onehippo.cms7:hippo-cms7-utilities:jar:1.01.03-SNAPSHOT is missing, no dependency information availableDownloading: http://maven.onehippo.com/maven2/org/onehippo/cms7/hippo-cms7-utilities/1.01.03-SNAPSHOT/hippo-cms7-utilities-1.01.03-SNAPSHOT.jar

     [java] [INFO] ------------------------------------------------------------------------[INFO] Reactor Summary:
     [java] [INFO] 
     [java] [INFO] Getting Started ................................... SUCCESS [2.088s]
     [java] [INFO] Getting Started Bootstrap ......................... SUCCESS [0.136s]
     [java] [INFO] Getting Started Bootstrap Configuration ........... SUCCESS [1.900s]
     [java] [INFO] Getting Started Bootstrap Content ................. SUCCESS [0.668s]
     [java] [INFO] Getting Started CMS ............................... FAILURE [1.612s]
     [java] [INFO] Getting Started Site .............................. SKIPPED
     [java] [INFO] ------------------------------------------------------------------------
     [java] [INFO] BUILD FAILURE
     [java] [INFO] ------------------------------------------------------------------------
     [java] [INFO] Total time: 6.836s
     [java] [INFO] Finished at: Mon Jan 07 07:18:56 CET 2013
     [java] [INFO] Final Memory: 15M/37M
     [java] [INFO] ------------------------------------------------------------------------
     [java] [ERROR] Failed to execute goal on project gettingstarted-cms: Could not resolve dependencies for project org.onehippo.cms7.hst:gettingstarted-cms:war:1.01.00: Could not find artifact org.onehippo.cms7:hippo-cms7-utilities:jar:1.01.03-SNAPSHOT in hippo (http://maven.onehippo.com/maven2/) -> [Help 1]
     [java] [ERROR] 
     [java] [ERROR] To see the full stack trace of the errors, re-run Maven with the -e switch.
     [java] [ERROR] Re-run Maven using the -X switch to enable full debug logging.
     [java] [ERROR] 
     [java] [ERROR] For more information about the errors and possible solutions, please read the following articles:
     [java] [ERROR] [Help 1] http://cwiki.apache.org/confluence/display/MAVEN/DependencyResolutionException
     [java] [ERROR] 
     [java] [ERROR] After correcting the problems, you can resume the build with the command
     [java] [ERROR]   mvn <goals> -rf :gettingstarted-cms
[INFO] ------------------------------------------------------------------------
[INFO] Reactor Summary:
[INFO] 
[INFO] Hippo CMS7 Site Toolkit Maven Archetypes .......... SUCCESS [2.788s]
[INFO] Hippo CMS7 Site Toolkit Website Archetype ......... FAILURE [16.996s]
[INFO] ------------------------------------------------------------------------
[INFO] BUILD FAILURE
[INFO] ------------------------------------------------------------------------
[INFO] Total time: 20.664s
[INFO] Finished at: Mon Jan 07 07:18:56 CET 2013
[INFO] Final Memory: 13M/32M
[INFO] ------------------------------------------------------------------------
[ERROR] Failed to execute goal org.apache.maven.plugins:maven-antrun-plugin:1.2:run (generate-and-install-gettingstarted) on project hippo-archetype-website: An Ant BuildException has occured: Java returned: 1 -> [Help 1]
org.apache.maven.lifecycle.LifecycleExecutionException: Failed to execute goal org.apache.maven.plugins:maven-antrun-plugin:1.2:run (generate-and-install-gettingstarted) on project hippo-archetype-website: An Ant BuildException has occured: Java returned: 1
	at org.apache.maven.lifecycle.internal.MojoExecutor.execute(MojoExecutor.java:217)
	at org.apache.maven.lifecycle.internal.MojoExecutor.execute(MojoExecutor.java:153)
	at org.apache.maven.lifecycle.internal.MojoExecutor.execute(MojoExecutor.java:145)
	at org.apache.maven.lifecycle.internal.LifecycleModuleBuilder.buildProject(LifecycleModuleBuilder.java:84)
	at org.apache.maven.lifecycle.internal.LifecycleModuleBuilder.buildProject(LifecycleModuleBuilder.java:59)
	at org.apache.maven.lifecycle.internal.LifecycleStarter.singleThreadedBuild(LifecycleStarter.java:183)
	at org.apache.maven.lifecycle.internal.LifecycleStarter.execute(LifecycleStarter.java:161)
	at org.apache.maven.DefaultMaven.doExecute(DefaultMaven.java:320)
	at org.apache.maven.DefaultMaven.execute(DefaultMaven.java:156)
	at org.apache.maven.cli.MavenCli.execute(MavenCli.java:537)
	at org.apache.maven.cli.MavenCli.doMain(MavenCli.java:196)
	at org.apache.maven.cli.MavenCli.main(MavenCli.java:141)
	at sun.reflect.NativeMethodAccessorImpl.invoke0(Native Method)
	at sun.reflect.NativeMethodAccessorImpl.invoke(NativeMethodAccessorImpl.java:39)
	at sun.reflect.DelegatingMethodAccessorImpl.invoke(DelegatingMethodAccessorImpl.java:25)
	at java.lang.reflect.Method.invoke(Method.java:597)
	at org.codehaus.plexus.classworlds.launcher.Launcher.launchEnhanced(Launcher.java:290)
	at org.codehaus.plexus.classworlds.launcher.Launcher.launch(Launcher.java:230)
	at org.codehaus.plexus.classworlds.launcher.Launcher.mainWithExitCode(Launcher.java:409)
	at org.codehaus.plexus.classworlds.launcher.Launcher.main(Launcher.java:352)
Caused by: org.apache.maven.plugin.MojoExecutionException: An Ant BuildException has occured: Java returned: 1
	at org.apache.maven.plugin.antrun.AbstractAntMojo.executeTasks(AbstractAntMojo.java:131)
	at org.apache.maven.plugin.antrun.AntRunMojo.execute(AntRunMojo.java:98)
	at org.apache.maven.plugin.DefaultBuildPluginManager.executeMojo(DefaultBuildPluginManager.java:101)
	at org.apache.maven.lifecycle.internal.MojoExecutor.execute(MojoExecutor.java:209)
	... 19 more
Caused by: Java returned: 1
	at org.apache.tools.ant.taskdefs.Java.execute(Java.java:87)
	at org.apache.tools.ant.UnknownElement.execute(UnknownElement.java:275)
	at org.apache.tools.ant.Task.perform(Task.java:364)
	at org.apache.tools.ant.Target.execute(Target.java:341)
	at org.apache.maven.plugin.antrun.AbstractAntMojo.executeTasks(AbstractAntMojo.java:118)
	... 22 more
[ERROR] 
[ERROR] Re-run Maven using the -X switch to enable full debug logging.
[ERROR] 
[ERROR] For more information about the errors and possible solutions, please read the following articles:
[ERROR] [Help 1] http://cwiki.apache.org/confluence/display/MAVEN/MojoExecutionException
[ERROR] 
[ERROR] After correcting the problems, you can resume the build with the command
[ERROR]   mvn <goals> -rf :hippo-archetype-website

--
This message is automatically generated by Hudson. 
For more information on Hudson, see: http://hudson-ci.org/


More information about the Hippo-cms7-dev mailing list