[Hippo-cms7-dev] [Hudson] Build failed in Hudson: hippo-jcr-repository-service trunk #457

Hippo Public Hudson Server beheer at onehippo.com
Sat Jan 12 07:03:44 CET 2013


See <https://builds.onehippo.org/job/hippo-jcr-repository-service%20trunk/457/>

------------------------------------------
Started by timer
Cleaning up <https://builds.onehippo.org/job/hippo-jcr-repository-service%20trunk/ws/.>
Deleting <https://builds.onehippo.org/job/hippo-jcr-repository-service%20trunk/ws/target>
Updating http://svn.onehippo.org/repos/hippo/hippo-jcr/repository-service/trunk revision: Jan 12, 2013 7:03:44 AM depth:infinity ignoreExternals: false
ERROR: Failed to update http://svn.onehippo.org/repos/hippo/hippo-jcr/repository-service/trunk
org.tmatesoft.svn.core.SVNException: svn: E200030: READONLY
	at org.tmatesoft.svn.core.internal.wc.SVNErrorManager.error(SVNErrorManager.java:64)
	at org.tmatesoft.svn.core.internal.wc.SVNErrorManager.error(SVNErrorManager.java:51)
	at org.tmatesoft.svn.core.internal.db.SVNSqlJetDb.createSqlJetError(SVNSqlJetDb.java:174)
	at org.tmatesoft.svn.core.internal.db.SVNSqlJetDb.beginTransaction(SVNSqlJetDb.java:190)
	at org.tmatesoft.svn.core.internal.db.SVNSqlJetDb.runTransaction(SVNSqlJetDb.java:236)
	at org.tmatesoft.svn.core.internal.db.SVNSqlJetDb.runTransaction(SVNSqlJetDb.java:231)
	at org.tmatesoft.svn.core.internal.wc17.db.SVNWCDb.obtainWCLock(SVNWCDb.java:4022)
	at org.tmatesoft.svn.core.internal.wc17.SVNWCContext.acquireWriteLock(SVNWCContext.java:1494)
	at org.tmatesoft.svn.core.internal.wc2.ng.SvnNgAbstractUpdate.update(SvnNgAbstractUpdate.java:72)
	at org.tmatesoft.svn.core.internal.wc2.ng.SvnNgUpdate.run(SvnNgUpdate.java:38)
	at org.tmatesoft.svn.core.internal.wc2.ng.SvnNgUpdate.run(SvnNgUpdate.java:18)
	at org.tmatesoft.svn.core.internal.wc2.ng.SvnNgOperationRunner.run(SvnNgOperationRunner.java:20)
	at org.tmatesoft.svn.core.internal.wc2.SvnOperationRunner.run(SvnOperationRunner.java:20)
	at org.tmatesoft.svn.core.wc2.SvnOperationFactory.run(SvnOperationFactory.java:1235)
	at org.tmatesoft.svn.core.wc2.SvnOperation.run(SvnOperation.java:291)
	at org.tmatesoft.svn.core.wc.SVNUpdateClient.doUpdate(SVNUpdateClient.java:311)
	at org.tmatesoft.svn.core.wc.SVNUpdateClient.doUpdate(SVNUpdateClient.java:291)
	at org.tmatesoft.svn.core.wc.SVNUpdateClient.doUpdate(SVNUpdateClient.java:387)
	at hudson.scm.subversion.UpdateUpdater$TaskImpl.perform(UpdateUpdater.java:134)
	at hudson.scm.subversion.WorkspaceUpdater$UpdateTask.delegateTo(WorkspaceUpdater.java:152)
	at hudson.scm.SubversionSCM$CheckOutTask.perform(SubversionSCM.java:807)
	at hudson.scm.SubversionSCM$CheckOutTask.invoke(SubversionSCM.java:790)
	at hudson.scm.SubversionSCM$CheckOutTask.invoke(SubversionSCM.java:771)
	at hudson.FilePath.act(FilePath.java:791)
	at hudson.FilePath.act(FilePath.java:773)
	at hudson.scm.SubversionSCM.checkout(SubversionSCM.java:763)
	at hudson.scm.SubversionSCM.checkout(SubversionSCM.java:706)
	at hudson.model.AbstractProject.checkout(AbstractProject.java:1515)
	at hudson.model.AbstractBuild$AbstractRunner.checkout(AbstractBuild.java:521)
	at hudson.model.AbstractBuild$AbstractRunner.run(AbstractBuild.java:428)
	at hudson.model.Run.run(Run.java:1390)
	at hudson.maven.MavenModuleSetBuild.run(MavenModuleSetBuild.java:420)
	at hudson.model.ResourceController.execute(ResourceController.java:81)
	at hudson.model.Executor.run(Executor.java:137)
Caused by: org.tmatesoft.sqljet.core.SqlJetException: READONLY: error code is READONLY
	at org.tmatesoft.sqljet.core.internal.btree.SqlJetBtree.beginTrans(SqlJetBtree.java:894)
	at org.tmatesoft.sqljet.core.table.engine.SqlJetEngine.doBeginTransaction(SqlJetEngine.java:561)
	at org.tmatesoft.sqljet.core.table.engine.SqlJetEngine.access$100(SqlJetEngine.java:55)
	at org.tmatesoft.sqljet.core.table.engine.SqlJetEngine$9.runSynchronized(SqlJetEngine.java:475)
	at org.tmatesoft.sqljet.core.table.engine.SqlJetEngine.runSynchronized(SqlJetEngine.java:217)
	at org.tmatesoft.sqljet.core.table.engine.SqlJetEngine.beginTransaction(SqlJetEngine.java:471)
	at org.tmatesoft.svn.core.internal.db.SVNSqlJetDb.beginTransaction(SVNSqlJetDb.java:185)
	... 30 more
Skipping sonar analysis due to bad build status FAILURE

--
This message is automatically generated by Hudson. 
For more information on Hudson, see: http://hudson-ci.org/


More information about the Hippo-cms7-dev mailing list