[Hippo-cms7-dev] [Hudson] Build failed in Hudson: GoGreen-trunk Nightly #579

Hippo Public Hudson Server beheer at onehippo.com
Fri Jan 18 07:04:10 CET 2013


See <https://builds.onehippo.org/job/GoGreen-trunk%20Nightly/579/>

------------------------------------------
[...truncated 146 lines...]
INFO: basic authentication scheme selected
Jan 18, 2013 7:02:52 AM org.apache.commons.httpclient.auth.AuthChallengeProcessor selectAuthScheme
INFO: basic authentication scheme selected
Uploaded: https://maven.onehippo.com/content/repositories/snapshots/com/onehippo/gogreen/hippogogreen/3.07.02-SNAPSHOT/maven-metadata.xml (2 KB at 2.6 KB/sec)
Uploading: https://maven.onehippo.com/content/repositories/snapshots/com/onehippo/gogreen/hippogogreen/maven-metadata.xml
Jan 18, 2013 7:02:52 AM org.apache.commons.httpclient.auth.AuthChallengeProcessor selectAuthScheme
INFO: basic authentication scheme selected
Jan 18, 2013 7:02:52 AM org.apache.commons.httpclient.auth.AuthChallengeProcessor selectAuthScheme
INFO: basic authentication scheme selected
Jan 18, 2013 7:02:53 AM org.apache.commons.httpclient.auth.AuthChallengeProcessor selectAuthScheme
INFO: basic authentication scheme selected
Uploaded: https://maven.onehippo.com/content/repositories/snapshots/com/onehippo/gogreen/hippogogreen/maven-metadata.xml (880 B at 1.9 KB/sec)
projectSucceeded com.onehippo.gogreen:hippogogreen:3.07.02-SNAPSHOT
sessionEnded
[INFO] ------------------------------------------------------------------------
[INFO] BUILD SUCCESS
[INFO] ------------------------------------------------------------------------
[INFO] Total time: 49.928s
[INFO] Finished at: Fri Jan 18 07:02:53 CET 2013
[INFO] Final Memory: 10M/25M
[INFO] ------------------------------------------------------------------------
maven builder waiting
channel stopped
[workspace] $ /bin/sh -xe /tmp/hudson5174504822934720104.sh
+ wget -O /dev/null 'https://builds.onehippo.com/job/GoGreen%20Enterprise%20Trunk/build?token=remote_build'
--2013-01-18 07:02:53--  https://builds.onehippo.com/job/GoGreen%20Enterprise%20Trunk/build?token=remote_build
Resolving builds.onehippo.com... 85.17.203.33
Connecting to builds.onehippo.com|85.17.203.33|:443... connected.
HTTP request sent, awaiting response... 302 Found
Location: https://builds.onehippo.com/job/GoGreen%20Enterprise%20Trunk/ [following]
--2013-01-18 07:02:53--  https://builds.onehippo.com/job/GoGreen%20Enterprise%20Trunk/
Reusing existing connection to builds.onehippo.com:443.
HTTP request sent, awaiting response... 200 OK
Length: unspecified [text/html]
Saving to: `/dev/null'

     0K .......... .......... ..........                       7.35M=0.004s

2013-01-18 07:02:56 (7.35 MB/s) - `/dev/null' saved [30832]

[workspace] $ /home/hudson/software/maven/apache-maven-3.0-latest/bin/mvn -f "<https://builds.onehippo.org/job/GoGreen-trunk%20Nightly/ws/pom.xml"> -e -B sonar:sonar -Dhippo.snapshots -Dsonar.jdbc.driver=com.mysql.jdbc.Driver -Dsonar.jdbc.url=jdbc:mysql://172.17.15.19:3306/sonar_public?autoReconnect=true&useUnicode=true&amp;characterEncoding=utf8 ******** ******** -Dsonar.host.url=http://sonar-public.lan:9000
[INFO] Error stacktraces are turned on.
[INFO] Scanning for projects...
[INFO] ------------------------------------------------------------------------
[INFO] Reactor Build Order:
[INFO] 
[INFO] Hippo Go Green
[INFO] Hippo Go Green Content
[INFO] Hippo Go Green Rating Plugin
[INFO] Hippo Go Green CMS
[INFO] Hippo Go Green Site Assembly
[INFO] Hippo Go Green Site
[INFO] Hippo Go Green Integration Tests
[INFO] Hippo Go Green Server Configurations
[INFO] Hippo Go Green Test Server Configuration
[INFO] Hippo Go Green Acct Server Configuration
[INFO] Hippo Go Green Prod Server Configuration
[INFO]                                                                         
[INFO] ------------------------------------------------------------------------
[INFO] Building Hippo Go Green 3.07.02-SNAPSHOT
[INFO] ------------------------------------------------------------------------
Downloading: http://maven.onehippo.com/maven2-snapshots/org/onehippo/cms7/hst/hst/2.26.01-SNAPSHOT/hst-2.26.01-20130118.053308-42.pom
Downloaded: http://maven.onehippo.com/maven2-snapshots/org/onehippo/cms7/hst/hst/2.26.01-SNAPSHOT/hst-2.26.01-20130118.053308-42.pom (29 KB at 62.5 KB/sec)
Downloading: http://maven.onehippo.com/maven2-snapshots/org/onehippo/cms7/hippo-cms-automatic-export/2.24.01-SNAPSHOT/hippo-cms-automatic-export-2.24.01-20130118.043835-38.pom
Downloaded: http://maven.onehippo.com/maven2-snapshots/org/onehippo/cms7/hippo-cms-automatic-export/2.24.01-SNAPSHOT/hippo-cms-automatic-export-2.24.01-20130118.043835-38.pom (2 KB at 2.6 KB/sec)
Downloading: http://maven.onehippo.com/maven2-snapshots/org/onehippo/cms7/hst/dependencies/2.26.01-SNAPSHOT/dependencies-2.26.01-20130118.053650-41.pom
Downloaded: http://maven.onehippo.com/maven2-snapshots/org/onehippo/cms7/hst/dependencies/2.26.01-SNAPSHOT/dependencies-2.26.01-20130118.053650-41.pom (2 KB at 5.6 KB/sec)
Downloading: http://maven.onehippo.com/maven2-snapshots/org/onehippo/cms7/hst/toolkit-resources/addon/toolkit-cnd/2.26.01-SNAPSHOT/toolkit-cnd-2.26.01-20130118.053341-42.pom
Downloaded: http://maven.onehippo.com/maven2-snapshots/org/onehippo/cms7/hst/toolkit-resources/addon/toolkit-cnd/2.26.01-SNAPSHOT/toolkit-cnd-2.26.01-20130118.053341-42.pom (2 KB at 3.8 KB/sec)
Downloading: http://maven.onehippo.com/maven2-snapshots/org/onehippo/cms7/hst/toolkit-resources/addon/2.26.01-SNAPSHOT/addon-2.26.01-20130118.053339-42.pom
Downloaded: http://maven.onehippo.com/maven2-snapshots/org/onehippo/cms7/hst/toolkit-resources/addon/2.26.01-SNAPSHOT/addon-2.26.01-20130118.053339-42.pom (2 KB at 10.7 KB/sec)
Downloading: http://maven.onehippo.com/maven2-snapshots/org/onehippo/cms7/hst/dependencies/hst-cms-dependencies/2.26.01-SNAPSHOT/hst-cms-dependencies-2.26.01-20130118.053715-41.pom
Downloaded: http://maven.onehippo.com/maven2-snapshots/org/onehippo/cms7/hst/dependencies/hst-cms-dependencies/2.26.01-SNAPSHOT/hst-cms-dependencies-2.26.01-20130118.053715-41.pom (2 KB at 10.3 KB/sec)
Downloading: http://maven.onehippo.com/maven2-snapshots/org/onehippo/cms7/hippo-addon-channel-manager/2.24.01-SNAPSHOT/hippo-addon-channel-manager-2.24.01-20130118.050802-42.pom
Downloaded: http://maven.onehippo.com/maven2-snapshots/org/onehippo/cms7/hippo-addon-channel-manager/2.24.01-SNAPSHOT/hippo-addon-channel-manager-2.24.01-20130118.050802-42.pom (7 KB at 11.7 KB/sec)
Downloading: http://maven.onehippo.com/maven2-snapshots/org/onehippo/cms7/hippo-addon-hst-configuration-editor-frontend/1.11.01-SNAPSHOT/hippo-addon-hst-configuration-editor-frontend-1.11.01-20130118.050959-41.pom
Downloaded: http://maven.onehippo.com/maven2-snapshots/org/onehippo/cms7/hippo-addon-hst-configuration-editor-frontend/1.11.01-SNAPSHOT/hippo-addon-hst-configuration-editor-frontend-1.11.01-20130118.050959-41.pom (4 KB at 15.4 KB/sec)
Downloading: http://maven.onehippo.com/maven2-snapshots/org/onehippo/cms7/hippo-addon-hst-configuration-editor-repository/1.11.01-SNAPSHOT/hippo-addon-hst-configuration-editor-repository-1.11.01-20130118.051002-41.pom
Downloaded: http://maven.onehippo.com/maven2-snapshots/org/onehippo/cms7/hippo-addon-hst-configuration-editor-repository/1.11.01-SNAPSHOT/hippo-addon-hst-configuration-editor-repository-1.11.01-20130118.051002-41.pom (3 KB at 6.0 KB/sec)
Downloading: http://maven.onehippo.com/maven2-snapshots/com/onehippo/gogreen/hippogogreen-rating-plugin/3.07.02-SNAPSHOT/maven-metadata.xml
Downloaded: http://maven.onehippo.com/maven2-snapshots/com/onehippo/gogreen/hippogogreen-rating-plugin/3.07.02-SNAPSHOT/maven-metadata.xml (1022 B at 2.4 KB/sec)
Downloading: http://maven.onehippo.com/maven2-snapshots/com/onehippo/gogreen/hippogogreen-content/3.07.02-SNAPSHOT/maven-metadata.xml
Downloaded: http://maven.onehippo.com/maven2-snapshots/com/onehippo/gogreen/hippogogreen-content/3.07.02-SNAPSHOT/maven-metadata.xml (1016 B at 3.1 KB/sec)
Downloading: http://maven.onehippo.com/maven2-snapshots/org/onehippo/addon/frontend/gallerypicker/gallerypicker/1.10.02-SNAPSHOT/maven-metadata.xml
Downloaded: http://maven.onehippo.com/maven2-snapshots/org/onehippo/addon/frontend/gallerypicker/gallerypicker/1.10.02-SNAPSHOT/maven-metadata.xml (2 KB at 3.0 KB/sec)
Downloading: http://maven.onehippo.com/maven2-snapshots/org/onehippo/addon/frontend/gallerypicker/gallerypicker/1.10.02-SNAPSHOT/gallerypicker-1.10.02-20130117.221208-5.pom
Downloaded: http://maven.onehippo.com/maven2-snapshots/org/onehippo/addon/frontend/gallerypicker/gallerypicker/1.10.02-SNAPSHOT/gallerypicker-1.10.02-20130117.221208-5.pom (11 KB at 135.5 KB/sec)
Downloading: http://maven.onehippo.com/maven2-snapshots/org/onehippo/cms7/hst/client-modules/hst-google-analytics-repository/2.26.01-SNAPSHOT/hst-google-analytics-repository-2.26.01-20130118.053645-41.pom
Downloaded: http://maven.onehippo.com/maven2-snapshots/org/onehippo/cms7/hst/client-modules/hst-google-analytics-repository/2.26.01-SNAPSHOT/hst-google-analytics-repository-2.26.01-20130118.053645-41.pom (2 KB at 4.9 KB/sec)
Downloading: http://maven.onehippo.com/maven2-snapshots/org/onehippo/cms7/hst/client-modules/2.26.01-SNAPSHOT/client-modules-2.26.01-20130118.053610-41.pom
Downloaded: http://maven.onehippo.com/maven2-snapshots/org/onehippo/cms7/hst/client-modules/2.26.01-SNAPSHOT/client-modules-2.26.01-20130118.053610-41.pom (2 KB at 1.2 KB/sec)
Downloading: http://maven.onehippo.com/maven2-snapshots/org/onehippo/cms7/hippo-addon-hst-configuration-editor-frontend/1.11.01-SNAPSHOT/hippo-addon-hst-configuration-editor-frontend-1.11.01-20130118.050959-41.jar
Downloading: http://maven.onehippo.com/maven2-snapshots/org/onehippo/cms7/hippo-addon-hst-configuration-editor-repository/1.11.01-SNAPSHOT/hippo-addon-hst-configuration-editor-repository-1.11.01-20130118.051002-41.jar
Downloading: http://maven.onehippo.com/maven2-snapshots/org/onehippo/cms7/hst/client-modules/hst-google-analytics-repository/2.26.01-SNAPSHOT/hst-google-analytics-repository-2.26.01-20130118.053645-41.jar
Downloading: http://maven.onehippo.com/maven2-snapshots/org/onehippo/addon/frontend/gallerypicker/gallerypicker/1.10.02-SNAPSHOT/gallerypicker-1.10.02-20130117.221208-5.jar
Downloaded: http://maven.onehippo.com/maven2-snapshots/org/onehippo/cms7/hippo-addon-hst-configuration-editor-repository/1.11.01-SNAPSHOT/hippo-addon-hst-configuration-editor-repository-1.11.01-20130118.051002-41.jar (30 KB at 112.2 KB/sec)
Downloaded: http://maven.onehippo.com/maven2-snapshots/org/onehippo/addon/frontend/gallerypicker/gallerypicker/1.10.02-SNAPSHOT/gallerypicker-1.10.02-20130117.221208-5.jar (46 KB at 165.8 KB/sec)
Downloaded: http://maven.onehippo.com/maven2-snapshots/org/onehippo/cms7/hst/client-modules/hst-google-analytics-repository/2.26.01-SNAPSHOT/hst-google-analytics-repository-2.26.01-20130118.053645-41.jar (13 KB at 43.6 KB/sec)
Downloaded: http://maven.onehippo.com/maven2-snapshots/org/onehippo/cms7/hippo-addon-hst-configuration-editor-frontend/1.11.01-SNAPSHOT/hippo-addon-hst-configuration-editor-frontend-1.11.01-20130118.050959-41.jar (335 KB at 1178.6 KB/sec)
Downloading: http://maven.onehippo.com/maven2-snapshots/com/onehippo/gogreen/hippogogreen-site-assembly/3.07.02-SNAPSHOT/maven-metadata.xml
Downloaded: http://maven.onehippo.com/maven2-snapshots/com/onehippo/gogreen/hippogogreen-site-assembly/3.07.02-SNAPSHOT/maven-metadata.xml (1022 B at 4.5 KB/sec)
Downloading: http://maven.onehippo.com/maven2-snapshots/org/onehippo/cms7/hst/dependencies/hst-server-dependencies/2.26.01-SNAPSHOT/hst-server-dependencies-2.26.01-20130118.053703-41.pom
Downloaded: http://maven.onehippo.com/maven2-snapshots/org/onehippo/cms7/hst/dependencies/hst-server-dependencies/2.26.01-SNAPSHOT/hst-server-dependencies-2.26.01-20130118.053703-41.pom (3 KB at 17.6 KB/sec)
Downloading: http://maven.onehippo.com/maven2-snapshots/org/onehippo/cms7/hst/dependencies/hst-spring-dependencies/2.26.01-SNAPSHOT/hst-spring-dependencies-2.26.01-20130118.053656-41.pom
Downloaded: http://maven.onehippo.com/maven2-snapshots/org/onehippo/cms7/hst/dependencies/hst-spring-dependencies/2.26.01-SNAPSHOT/hst-spring-dependencies-2.26.01-20130118.053656-41.pom (4 KB at 19.6 KB/sec)
Downloading: http://maven.onehippo.com/maven2-snapshots/org/onehippo/cms7/hst/client-modules/hst-page-composer/2.26.01-SNAPSHOT/hst-page-composer-2.26.01-20130118.053631-41.pom
Downloaded: http://maven.onehippo.com/maven2-snapshots/org/onehippo/cms7/hst/client-modules/hst-page-composer/2.26.01-SNAPSHOT/hst-page-composer-2.26.01-20130118.053631-41.pom (5 KB at 39.1 KB/sec)
Downloading: http://maven.onehippo.com/maven2-snapshots/org/onehippo/cms7/hst/client-modules/hst-google-analytics-hst/2.26.01-SNAPSHOT/hst-google-analytics-hst-2.26.01-20130118.053639-41.pom
Downloaded: http://maven.onehippo.com/maven2-snapshots/org/onehippo/cms7/hst/client-modules/hst-google-analytics-hst/2.26.01-SNAPSHOT/hst-google-analytics-hst-2.26.01-20130118.053639-41.pom (2 KB at 5.1 KB/sec)
Downloading: http://maven.onehippo.com/maven2-snapshots/org/onehippo/cms7/hst/client-modules/hst-page-composer/2.26.01-SNAPSHOT/hst-page-composer-2.26.01-20130118.053631-41.jar
Downloading: http://maven.onehippo.com/maven2-snapshots/org/onehippo/cms7/hst/client-modules/hst-google-analytics-hst/2.26.01-SNAPSHOT/hst-google-analytics-hst-2.26.01-20130118.053639-41.jar
Downloaded: http://maven.onehippo.com/maven2-snapshots/org/onehippo/cms7/hst/client-modules/hst-google-analytics-hst/2.26.01-SNAPSHOT/hst-google-analytics-hst-2.26.01-20130118.053639-41.jar (14 KB at 150.4 KB/sec)
Downloaded: http://maven.onehippo.com/maven2-snapshots/org/onehippo/cms7/hst/client-modules/hst-page-composer/2.26.01-SNAPSHOT/hst-page-composer-2.26.01-20130118.053631-41.jar (76 KB at 672.0 KB/sec)
Downloading: http://nexus.openqa.org/content/repositories/releases/com/onehippo/gogreen/hippogogreen-cms/3.07.02-SNAPSHOT/maven-metadata.xml
Downloading: http://maven.onehippo.com/maven2-snapshots/com/onehippo/gogreen/hippogogreen-cms/3.07.02-SNAPSHOT/maven-metadata.xml
Downloaded: http://maven.onehippo.com/maven2-snapshots/com/onehippo/gogreen/hippogogreen-cms/3.07.02-SNAPSHOT/maven-metadata.xml (1012 B at 2.9 KB/sec)
Downloading: http://maven.onehippo.com/maven2-snapshots/com/onehippo/gogreen/hippogogreen-site/3.07.02-SNAPSHOT/maven-metadata.xml
Downloading: http://nexus.openqa.org/content/repositories/releases/com/onehippo/gogreen/hippogogreen-site/3.07.02-SNAPSHOT/maven-metadata.xml
Downloaded: http://maven.onehippo.com/maven2-snapshots/com/onehippo/gogreen/hippogogreen-site/3.07.02-SNAPSHOT/maven-metadata.xml (2 KB at 5.7 KB/sec)
Downloading: http://nexus.openqa.org/content/repositories/releases/org/onehippo/cms7/hippo-services/1.02.02-SNAPSHOT/maven-metadata.xml
[INFO] 
[INFO] --- sonar-maven-plugin:2.0:sonar (default-cli) @ hippogogreen ---
[INFO] Sonar version: 3.4.1
[INFO] [07:03:51.272] Load project settings
[INFO] [07:03:51.492] Install plugins
[INFO] [07:03:55.108] Apply project exclusions
[INFO] [07:03:55.108] Install JDBC driver
[INFO] [07:03:55.124] Create JDBC datasource for jdbc:mysql://172.17.15.19:3306/sonar_public?autoReconnect=true&useUnicode=true&amp;characterEncoding=utf8
[INFO] [07:03:55.516] Initializing Hibernate
[INFO] [07:04:06.012] -------------  Analyzing Hippo Go Green Content
[INFO] [07:04:06.016] Load module settings
[INFO] [07:04:07.284] Quality profile : [name=Hippo OSS,language=java]
[INFO] [07:04:07.368] Configure maven plugins...
[INFO] [07:04:07.548] Compare over 7 days (2013-01-11, analysis of 2013-01-11 08:44:39.0)
[INFO] [07:04:07.596] Compare over 14 days (2013-01-04, analysis of 2013-01-04 07:10:16.0)
[INFO] [07:04:07.620] Compare over 30 days (2012-12-19, analysis of 2012-12-19 07:10:01.0)
[INFO] [07:04:08.012] Initializer FindbugsMavenInitializer...
[INFO] [07:04:08.016] Initializer FindbugsMavenInitializer done: 4 ms
[INFO] [07:04:08.016] Initializer ProjectFileSystemLogger...
[INFO] [07:04:08.020] Excluded tests: [**/package-info.java]
[INFO] [07:04:08.020] Source directories:
[INFO] [07:04:08.020]   <https://builds.onehippo.org/job/GoGreen-trunk%20Nightly/ws/content/src/main/java>
[INFO] [07:04:08.020] Initializer ProjectFileSystemLogger done: 4 ms
[INFO] [07:04:08.020] Initializer MavenInitializer...
[INFO] [07:04:08.020] Java source version: 1.6
[INFO] [07:04:08.020] Java target version: 1.6
[INFO] [07:04:08.020] Source encoding: UTF-8
[INFO] [07:04:08.020] Initializer MavenInitializer done: 0 ms
[INFO] [07:04:08.044] Sensor JavaSourceImporter...
[INFO] [07:04:08.132] Sensor JavaSourceImporter done: 88 ms
[INFO] [07:04:08.132] Sensor JavaSquidSensor...
[INFO] [07:04:08.320] Java AST scan...
[INFO] [07:04:08.548] Java AST scan done: 228 ms
[INFO] [07:04:08.548] Java bytecode scan...
[WARN] [07:04:08.620] Class 'com/onehippo/gogreen/repository/update/GoGreenGalleryUpdater' is not accessible through the ClassLoader.
[WARN] [07:04:08.620] Class 'com/onehippo/gogreen/repository/update/RelaxingGoGreenUpdater' is not accessible through the ClassLoader.
[WARN] [07:04:08.624] Class 'com/onehippo/gogreen/repository/update/GoGreenGalleryUpdater' is not accessible through the ClassLoader.
[WARN] [07:04:08.624] Class 'com/onehippo/gogreen/repository/update/RelaxingGoGreenUpdater' is not accessible through the ClassLoader.
[WARN] [07:04:08.624] Class 'com/onehippo/gogreen/repository/update/GoGreenGalleryUpdater' is not accessible through the ClassLoader.
[WARN] [07:04:08.624] Class 'com/onehippo/gogreen/repository/update/RelaxingGoGreenUpdater' is not accessible through the ClassLoader.
[INFO] [07:04:08.624] Java bytecode scan done: 76 ms
[INFO] [07:04:08.644] Package design analysis...
[INFO] [07:04:08.720] Package design analysis done: 76 ms
[INFO] [07:04:08.724] Sensor JavaSquidSensor done: 592 ms
[INFO] [07:04:08.724] Sensor org.onehippo.sonar.l10n.L10nSensor at 1f8d1f2...
[INFO] [07:04:08.732] sonar.l10n.sourceDirectories: no directory (properly) configured, falling back to default directories 'src/main/resources, src/main/java'
[INFO] [07:04:08.732] sonar.l10n.sourceDirectories: [<https://builds.onehippo.org/job/GoGreen-trunk%20Nightly/ws/content/src/main/resources,> <https://builds.onehippo.org/job/GoGreen-trunk%20Nightly/ws/content/src/main/java]>
[INFO] [07:04:08.824] sonar.l10n.locales: [it, fr, nl, de]
[INFO] [07:04:08.824] Sensor org.onehippo.sonar.l10n.L10nSensor at 1f8d1f2 done: 100 ms
[INFO] [07:04:08.824] Sensor FindbugsSensor...
[INFO] [07:04:08.824] Execute Findbugs 2.0.1...
[INFO] ------------------------------------------------------------------------
[INFO] Reactor Summary:
[INFO] 
[INFO] Hippo Go Green .................................... FAILURE [1:09.472s]
[INFO] Hippo Go Green Content ............................ SKIPPED
[INFO] Hippo Go Green Rating Plugin ...................... SKIPPED
[INFO] Hippo Go Green CMS ................................ SKIPPED
[INFO] Hippo Go Green Site Assembly ...................... SKIPPED
[INFO] Hippo Go Green Site ............................... SKIPPED
[INFO] Hippo Go Green Integration Tests .................. SKIPPED
[INFO] Hippo Go Green Server Configurations .............. SKIPPED
[INFO] Hippo Go Green Test Server Configuration .......... SKIPPED
[INFO] Hippo Go Green Acct Server Configuration .......... SKIPPED
[INFO] Hippo Go Green Prod Server Configuration .......... SKIPPED
[INFO] ------------------------------------------------------------------------
[INFO] BUILD FAILURE
[INFO] ------------------------------------------------------------------------
[INFO] Total time: 1:13.192s
[INFO] Finished at: Fri Jan 18 07:04:10 CET 2013
[INFO] Final Memory: 23M/66M
[INFO] ------------------------------------------------------------------------
[ERROR] Failed to execute goal org.codehaus.mojo:sonar-maven-plugin:2.0:sonar (default-cli) on project hippogogreen: Can not execute Sonar: Can not execute Findbugs: Findbugs needs sources to be compiled. Please build project before executing sonar and check the location of compiled classes. -> [Help 1]
org.apache.maven.lifecycle.LifecycleExecutionException: Failed to execute goal org.codehaus.mojo:sonar-maven-plugin:2.0:sonar (default-cli) on project hippogogreen: Can not execute Sonar
	at org.apache.maven.lifecycle.internal.MojoExecutor.execute(MojoExecutor.java:217)
	at org.apache.maven.lifecycle.internal.MojoExecutor.execute(MojoExecutor.java:153)
	at org.apache.maven.lifecycle.internal.MojoExecutor.execute(MojoExecutor.java:145)
	at org.apache.maven.lifecycle.internal.LifecycleModuleBuilder.buildProject(LifecycleModuleBuilder.java:84)
	at org.apache.maven.lifecycle.internal.LifecycleModuleBuilder.buildProject(LifecycleModuleBuilder.java:59)
	at org.apache.maven.lifecycle.internal.LifecycleStarter.singleThreadedBuild(LifecycleStarter.java:183)
	at org.apache.maven.lifecycle.internal.LifecycleStarter.execute(LifecycleStarter.java:161)
	at org.apache.maven.DefaultMaven.doExecute(DefaultMaven.java:320)
	at org.apache.maven.DefaultMaven.execute(DefaultMaven.java:156)
	at org.apache.maven.cli.MavenCli.execute(MavenCli.java:537)
	at org.apache.maven.cli.MavenCli.doMain(MavenCli.java:196)
	at org.apache.maven.cli.MavenCli.main(MavenCli.java:141)
	at sun.reflect.NativeMethodAccessorImpl.invoke0(Native Method)
	at sun.reflect.NativeMethodAccessorImpl.invoke(NativeMethodAccessorImpl.java:39)
	at sun.reflect.DelegatingMethodAccessorImpl.invoke(DelegatingMethodAccessorImpl.java:25)
	at java.lang.reflect.Method.invoke(Method.java:597)
	at org.codehaus.plexus.classworlds.launcher.Launcher.launchEnhanced(Launcher.java:290)
	at org.codehaus.plexus.classworlds.launcher.Launcher.launch(Launcher.java:230)
	at org.codehaus.plexus.classworlds.launcher.Launcher.mainWithExitCode(Launcher.java:409)
	at org.codehaus.plexus.classworlds.launcher.Launcher.main(Launcher.java:352)
Caused by: org.apache.maven.plugin.MojoExecutionException: Can not execute Sonar
	at org.codehaus.mojo.sonar.Bootstraper.executeMojo(Bootstraper.java:118)
	at org.codehaus.mojo.sonar.Bootstraper.start(Bootstraper.java:65)
	at org.codehaus.mojo.sonar.SonarMojo.execute(SonarMojo.java:90)
	at org.apache.maven.plugin.DefaultBuildPluginManager.executeMojo(DefaultBuildPluginManager.java:101)
	at org.apache.maven.lifecycle.internal.MojoExecutor.execute(MojoExecutor.java:209)
	... 19 more
Caused by: org.sonar.api.utils.SonarException: Can not execute Findbugs
	at org.sonar.plugins.findbugs.FindbugsExecutor.execute(FindbugsExecutor.java:134)
	at org.sonar.plugins.findbugs.FindbugsSensor.analyse(FindbugsSensor.java:62)
	at org.sonar.batch.phases.SensorsExecutor.execute(SensorsExecutor.java:64)
	at org.sonar.batch.phases.Phases.execute(Phases.java:91)
	at org.sonar.batch.bootstrap.ProjectModule.doStart(ProjectModule.java:129)
	at org.sonar.batch.bootstrap.Module.start(Module.java:68)
	at org.sonar.batch.bootstrap.BatchModule.analyze(BatchModule.java:147)
	at org.sonar.batch.bootstrap.BatchModule.analyze(BatchModule.java:141)
	at org.sonar.batch.bootstrap.BatchModule.doStart(BatchModule.java:136)
	at org.sonar.batch.bootstrap.Module.start(Module.java:68)
	at org.sonar.batch.bootstrap.BootstrapModule.doStart(BootstrapModule.java:83)
	at org.sonar.batch.bootstrap.Module.start(Module.java:68)
	at org.sonar.batch.bootstrapper.Batch.startBatch(Batch.java:75)
	at org.sonar.batch.bootstrapper.Batch.execute(Batch.java:60)
	at org.sonar.maven3.SonarMojo.execute(SonarMojo.java:142)
	at org.codehaus.mojo.sonar.Bootstraper.executeMojo(Bootstraper.java:113)
	... 23 more
Caused by: org.sonar.api.utils.SonarException: Findbugs needs sources to be compiled. Please build project before executing sonar and check the location of compiled classes.
	at org.sonar.plugins.findbugs.FindbugsConfiguration.getFindbugsProject(FindbugsConfiguration.java:72)
	at org.sonar.plugins.findbugs.FindbugsExecutor.execute(FindbugsExecutor.java:93)
	... 38 more
[ERROR] 
[ERROR] Re-run Maven using the -X switch to enable full debug logging.
[ERROR] 
[ERROR] For more information about the errors and possible solutions, please read the following articles:
[ERROR] [Help 1] http://cwiki.apache.org/confluence/display/MAVEN/MojoExecutionException
Sonar analysis completed: FAILURE

--
This message is automatically generated by Hudson. 
For more information on Hudson, see: http://hudson-ci.org/


More information about the Hippo-cms7-dev mailing list