[Hippo-cms7-dev] [Hudson] Build failed in Hudson: hippo-cms7-utilities Trunk #102

Hippo Public Hudson Server beheer at onehippo.com
Thu Jan 24 09:14:23 CET 2013


See <https://builds.onehippo.org/job/hippo-cms7-utilities%20Trunk/102/changes>

Changes:

[Ard Schrijvers] REPO-589 move HippoDateTools from repository engine to cms7-utilities and rename to DateTools. DateTools need to be accessible from cms and hst code as well

------------------------------------------
Started by an SCM change
Cleaning up <https://builds.onehippo.org/job/hippo-cms7-utilities%20Trunk/ws/.>
Deleting <https://builds.onehippo.org/job/hippo-cms7-utilities%20Trunk/ws/target>
Updating http://svn.onehippo.org/repos/hippo/hippo-cms7/utilities/trunk revision: Jan 24, 2013 9:14:15 AM depth:infinity ignoreExternals: false
A         src/main/java/org/onehippo/cms7/utilities/date
A         src/main/java/org/onehippo/cms7/utilities/date/DateTools.java
At revision 38025
Found mavenVersion 3.0.4 from file jar:file:/home/hudson/software/maven/apache-maven-3.0-latest/lib/maven-core-3.0.4.jar!/META-INF/maven/org.apache.maven/maven-core/pom.properties
Parsing POMs
[workspace] $ /home/hudson/software/jvm/jdk1.6.0_latest/bin/java -Xmx256m -cp /var/hudson-data/plugins/maven-plugin/WEB-INF/lib/maven3-agent-2.2.2.jar:/home/hudson/software/maven/apache-maven-3.0-latest/boot/plexus-classworlds-2.4.jar org.jvnet.hudson.maven3.agent.Maven3Main /home/hudson/software/maven/apache-maven-3.0-latest /var/hudson-data/war/webapp/WEB-INF/lib/hudson-remoting-3.0.0.jar /var/hudson-data/plugins/maven-plugin/WEB-INF/lib/maven3-interceptor-2.2.2.jar 38250
<===[HUDSON REMOTING CAPACITY]===>   channel started
Executing Maven:  -B -f <https://builds.onehippo.org/job/hippo-cms7-utilities%20Trunk/ws/pom.xml> -e -Dsurefire.useFile=false -U clean deploy -Dhippo.snapshots -DskipTests -Ppedantic
[INFO] Error stacktraces are turned on.
[INFO] Scanning for projects...
[INFO]                                                                         
[INFO] ------------------------------------------------------------------------
[INFO] Building Hippo CMS7 Utilities 1.01.03-SNAPSHOT
[INFO] ------------------------------------------------------------------------
[INFO] 
[INFO] --- maven-clean-plugin:2.4.1:clean (default-clean) @ hippo-cms7-utilities ---
[INFO] 
[INFO] --- apache-rat-plugin:0.9.RAT125:check (default) @ hippo-cms7-utilities ---
[INFO] Exclude: **/*.cnd
[INFO] Exclude: **/*.json
[INFO] Exclude: **/*.log
[INFO] Exclude: **/*.patch
[INFO] Exclude: **/*.properties
[INFO] Exclude: **/hippoecm-extension.xml
[INFO] Exclude: **/log4j.dtd
[INFO] Exclude: **/MANIFEST.MF
[INFO] Exclude: **/*.iml
mojoFailed org.apache.rat:apache-rat-plugin:0.9.RAT125(default)
projectFailed org.onehippo.cms7:hippo-cms7-utilities:1.01.03-SNAPSHOT
[HUDSON] Archiving <https://builds.onehippo.org/job/hippo-cms7-utilities%20Trunk/ws/pom.xml> to /var/hudson-data/jobs/hippo-cms7-utilities Trunk/modules/org.onehippo.cms7$hippo-cms7-utilities/builds/2013-01-24_09-14-17/archive/org.onehippo.cms7/hippo-cms7-utilities/1.01.03-SNAPSHOT/pom.xml
sessionEnded
[INFO] ------------------------------------------------------------------------
[INFO] BUILD FAILURE
[INFO] ------------------------------------------------------------------------
[INFO] Total time: 2.944s
[INFO] Finished at: Thu Jan 24 09:14:23 CET 2013
[INFO] Final Memory: 6M/16M
[INFO] ------------------------------------------------------------------------
mavenExecutionResult exceptions not empty
org.apache.maven.lifecycle.LifecycleExecutionException: Failed to execute goal org.apache.rat:apache-rat-plugin:0.9.RAT125:check (default) on project hippo-cms7-utilities: Too many unapproved licenses: 3
	at org.apache.maven.lifecycle.internal.MojoExecutor.execute(MojoExecutor.java:213)
	at org.apache.maven.lifecycle.internal.MojoExecutor.execute(MojoExecutor.java:153)
	at org.apache.maven.lifecycle.internal.MojoExecutor.execute(MojoExecutor.java:145)
	at org.apache.maven.lifecycle.internal.LifecycleModuleBuilder.buildProject(LifecycleModuleBuilder.java:84)
	at org.apache.maven.lifecycle.internal.LifecycleModuleBuilder.buildProject(LifecycleModuleBuilder.java:59)
	at org.apache.maven.lifecycle.internal.LifecycleStarter.singleThreadedBuild(LifecycleStarter.java:183)
	at org.apache.maven.lifecycle.internal.LifecycleStarter.execute(LifecycleStarter.java:161)
	at org.apache.maven.DefaultMaven.doExecute(DefaultMaven.java:320)
	at org.apache.maven.DefaultMaven.execute(DefaultMaven.java:156)
	at org.jvnet.hudson.maven3.launcher.Maven3Launcher.main(Maven3Launcher.java:79)
	at sun.reflect.NativeMethodAccessorImpl.invoke0(Native Method)
	at sun.reflect.NativeMethodAccessorImpl.invoke(NativeMethodAccessorImpl.java:39)
	at sun.reflect.DelegatingMethodAccessorImpl.invoke(DelegatingMethodAccessorImpl.java:25)
	at java.lang.reflect.Method.invoke(Method.java:597)
	at org.codehaus.plexus.classworlds.launcher.Launcher.launchStandard(Launcher.java:329)
	at org.codehaus.plexus.classworlds.launcher.Launcher.launch(Launcher.java:239)
	at org.jvnet.hudson.maven3.agent.Maven3Main.launch(Maven3Main.java:146)
	at hudson.maven.Maven3Builder.call(Maven3Builder.java:124)
	at hudson.maven.Maven3Builder.call(Maven3Builder.java:71)
	at hudson.remoting.UserRequest.perform(UserRequest.java:107)
	at hudson.remoting.UserRequest.perform(UserRequest.java:41)
	at hudson.remoting.Request$2.run(Request.java:276)
	at java.util.concurrent.Executors$RunnableAdapter.call(Executors.java:441)
	at java.util.concurrent.FutureTask$Sync.innerRun(FutureTask.java:303)
	at java.util.concurrent.FutureTask.run(FutureTask.java:138)
	at java.util.concurrent.ThreadPoolExecutor$Worker.runTask(ThreadPoolExecutor.java:886)
	at java.util.concurrent.ThreadPoolExecutor$Worker.run(ThreadPoolExecutor.java:908)
	at java.lang.Thread.run(Thread.java:662)
Caused by: org.apache.rat.mp.RatCheckException: Too many unapproved licenses: 3
	at org.apache.rat.mp.RatCheckMojo.check(RatCheckMojo.java:181)
	at org.apache.rat.mp.RatCheckMojo.execute(RatCheckMojo.java:171)
	at org.apache.maven.plugin.DefaultBuildPluginManager.executeMojo(DefaultBuildPluginManager.java:101)
	at org.apache.maven.lifecycle.internal.MojoExecutor.execute(MojoExecutor.java:209)
	... 27 more
Sending e-mails to: hippo-cms7-dev at lists.onehippo.org
channel stopped
Skipping sonar analysis due to bad build status FAILURE

--
This message is automatically generated by Hudson. 
For more information on Hudson, see: http://hudson-ci.org/


More information about the Hippo-cms7-dev mailing list