[Hippo-cms7-dev] [Hudson] Build failed in Hudson: hippo-repository Trunk Nightly #566

Hippo Public Hudson Server beheer at onehippo.com
Mon Jan 28 04:04:38 CET 2013


See <https://builds.onehippo.org/job/hippo-repository%20Trunk%20Nightly/566/changes>

Changes:

[mnour] REPO-582: Add getNodePath to JcUtils
  - Renamed getNodePath to getNodePathQuietly

[Unico Hommes] REPO-592 add additional type for publication requests on documents that are members of a workflow collection and signal that no actions can be performed on such requests

------------------------------------------
[...truncated 1523 lines...]
Jan 28, 2013 4:04:30 AM org.apache.commons.httpclient.auth.AuthChallengeProcessor selectAuthScheme
INFO: basic authentication scheme selected
Uploaded: https://maven.onehippo.com/content/repositories/snapshots/org/onehippo/cms7/hippo-addon-wfdropbox/2.24.02-SNAPSHOT/maven-metadata.xml (2 KB at 11.0 KB/sec)
projectSucceeded org.onehippo.cms7:hippo-addon-wfdropbox:2.24.02-SNAPSHOT
[HUDSON] Archiving <https://builds.onehippo.org/job/hippo-repository%20Trunk%20Nightly/ws/wfdropbox/pom.xml> to /var/hudson-data/jobs/hippo-repository Trunk Nightly/modules/org.onehippo.cms7$hippo-addon-wfdropbox/builds/2013-01-28_04-02-26/archive/org.onehippo.cms7/hippo-addon-wfdropbox/2.24.02-SNAPSHOT/pom.xml
[HUDSON] Archiving <https://builds.onehippo.org/job/hippo-repository%20Trunk%20Nightly/ws/wfdropbox/target/hippo-addon-wfdropbox-2.24.02-SNAPSHOT.jar> to /var/hudson-data/jobs/hippo-repository Trunk Nightly/modules/org.onehippo.cms7$hippo-addon-wfdropbox/builds/2013-01-28_04-02-26/archive/org.onehippo.cms7/hippo-addon-wfdropbox/2.24.02-20130128.030429-30/hippo-addon-wfdropbox-2.24.02-SNAPSHOT.jar
[HUDSON] Archiving <https://builds.onehippo.org/job/hippo-repository%20Trunk%20Nightly/ws/wfdropbox/target/hippo-addon-wfdropbox-2.24.02-SNAPSHOT-sources.jar> to /var/hudson-data/jobs/hippo-repository Trunk Nightly/modules/org.onehippo.cms7$hippo-addon-wfdropbox/builds/2013-01-28_04-02-26/archive/org.onehippo.cms7/hippo-addon-wfdropbox/2.24.02-20130128.030429-30/hippo-addon-wfdropbox-2.24.02-SNAPSHOT-sources.jar
[INFO]                                                                         
[INFO] ------------------------------------------------------------------------
[INFO] Building Repository workflow implementations 2.24.02-SNAPSHOT
[INFO] ------------------------------------------------------------------------
[WARNING] Failure to transfer asm:asm/maven-metadata.xml from file:../../local.repository/trunk was cached in the local repository, resolution will not be reattempted until the update interval of local.repository has elapsed or updates are forced. Original error: Could not transfer metadata asm:asm/maven-metadata.xml from/to local.repository (file:../../local.repository/trunk): No connector available to access repository local.repository (file:../../local.repository/trunk) of type legacy using the available factories WagonRepositoryConnectorFactory
Downloading: http://maven.onehippo.com/maven2-snapshots/asm/asm/maven-metadata.xml
Downloading: http://maven.onehippo.com/maven2/asm/asm/maven-metadata.xml
[INFO] 
[INFO] --- maven-clean-plugin:2.4.1:clean (default-clean) @ hippo-repository-workflow ---
[INFO] 
[INFO] --- maven-remote-resources-plugin:1.4:process (default) @ hippo-repository-workflow ---
[INFO] artifact asm:asm: checking for updates from hippo-maven2-snapshots
[INFO] artifact asm:asm: checking for updates from hippo
[INFO] artifact asm:asm: checking for updates from hippo-maven2
[INFO] artifact asm:asm: checking for updates from central
[INFO] artifact asm:asm: checking for updates from local.repository
[INFO] artifact asm:asm: checking for updates from DN_M2_Repo
[INFO] 
[INFO] --- maven-resources-plugin:2.6:resources (default-resources) @ hippo-repository-workflow ---
[INFO] Using 'UTF-8' encoding to copy filtered resources.
[INFO] Copying 16 resources
[INFO] Copying 3 resources
[INFO] 
[INFO] --- maven-compiler-plugin:2.5.1:compile (default-compile) @ hippo-repository-workflow ---
[INFO] Compiling 13 source files to <https://builds.onehippo.org/job/hippo-repository%20Trunk%20Nightly/ws/workflow/target/classes>
[INFO] 
[INFO] --- maven-datanucleus-plugin:2.2.1:enhance (default) @ hippo-repository-workflow ---
[WARNING] Failure to transfer asm:asm/maven-metadata.xml from file:../../local.repository/trunk was cached in the local repository, resolution will not be reattempted until the update interval of local.repository has elapsed or updates are forced. Original error: Could not transfer metadata asm:asm/maven-metadata.xml from/to local.repository (file:../../local.repository/trunk): No connector available to access repository local.repository (file:../../local.repository/trunk) of type legacy using the available factories WagonRepositoryConnectorFactory
[INFO]   CP: /var/hudson-data/repository/m2/org/datanucleus/maven-datanucleus-plugin/2.2.1/maven-datanucleus-plugin-2.2.1.jar
[INFO]   CP: /var/hudson-data/repository/m2/org/datanucleus/datanucleus-core/2.2.2/datanucleus-core-2.2.2.jar
[INFO]   CP: /var/hudson-data/repository/m2/javax/jcr/jcr/2.0/jcr-2.0.jar
[INFO]   CP: <https://builds.onehippo.org/job/hippo-repository%20Trunk%20Nightly/ws/api/target/hippo-repository-api-2.24.02-SNAPSHOT.jar>
[INFO]   CP: <https://builds.onehippo.org/job/hippo-repository%20Trunk%20Nightly/ws/builtin/target/hippo-repository-builtin-2.24.02-SNAPSHOT.jar>
[INFO]   CP: /var/hudson-data/repository/m2/org/slf4j/slf4j-api/1.6.4/slf4j-api-1.6.4.jar
[INFO]   CP: /var/hudson-data/repository/m2/log4j/log4j/1.2.16/log4j-1.2.16.jar
[INFO]   CP: /var/hudson-data/repository/m2/org/datanucleus/datanucleus-enhancer/2.1.3/datanucleus-enhancer-2.1.3.jar
[INFO]   CP: /var/hudson-data/repository/m2/javax/jdo/jdo-api/3.0/jdo-api-3.0.jar
[INFO]   CP: /var/hudson-data/repository/m2/javax/transaction/transaction-api/1.1/transaction-api-1.1.jar
[INFO]   CP: /var/hudson-data/repository/m2/org/datanucleus/datanucleus-rdbms/2.2.4/datanucleus-rdbms-2.2.4.jar
[INFO]   CP: /var/hudson-data/repository/m2/org/datanucleus/datanucleus-jpa/2.1.8/datanucleus-jpa-2.1.8.jar
[INFO]   CP: /var/hudson-data/repository/m2/org/apache/geronimo/specs/geronimo-jpa_2.0_spec/1.0/geronimo-jpa_2.0_spec-1.0.jar
[INFO]   CP: /var/hudson-data/repository/m2/asm/asm/3.3.1/asm-3.3.1.jar
[INFO]   CP: /var/hudson-data/repository/m2/org/codehaus/plexus/plexus-utils/1.2/plexus-utils-1.2.jar
[INFO]   CP: /var/hudson-data/repository/m2/junit/junit/3.8.1/junit-3.8.1.jar
[INFO]   CP: <https://builds.onehippo.org/job/hippo-repository%20Trunk%20Nightly/ws/workflow/target/classes>
[INFO]   CP: <https://builds.onehippo.org/job/hippo-repository%20Trunk%20Nightly/ws/utilities/target/hippo-repository-utilities-2.24.02-SNAPSHOT.jar>
[INFO]   CP: /var/hudson-data/repository/m2/org/apache/jackrabbit/jackrabbit-jcr-commons/2.2.13-h5/jackrabbit-jcr-commons-2.2.13-h5.jar
[INFO]   CP: /var/hudson-data/repository/m2/commons-io/commons-io/1.4/commons-io-1.4.jar
DataNucleus Enhancer (version 2.1.3) : Enhancement of classes
DataNucleus Enhancer : Classpath
>>  /var/hudson-data/plugins/maven-plugin/WEB-INF/lib/maven3-agent-2.2.2.jar
>>  /home/hudson/software/maven/apache-maven-3.0-latest/boot/plexus-classworlds-2.4.jar
ENHANCED (PersistenceCapable) : org.hippoecm.repository.reviewedactions.UnlockWorkflowImpl
ENHANCED (PersistenceCapable) : org.hippoecm.repository.reviewedactions.ScheduledRequestWorkflowImpl
ENHANCED (PersistenceCapable) : org.hippoecm.repository.reviewedactions.FullReviewedActionsWorkflowImpl
ENHANCED (PersistenceCapable) : org.hippoecm.repository.reviewedactions.PublishableDocument
ENHANCED (PersistenceCapable) : org.hippoecm.repository.reviewedactions.PublicationRequest
ENHANCED (PersistenceCapable) : org.hippoecm.repository.reviewedactions.BasicRequestWorkflowImpl
ENHANCED (PersistenceCapable) : org.hippoecm.repository.reviewedactions.FullRequestWorkflowImpl
ENHANCED (PersistenceCapable) : org.hippoecm.repository.reviewedactions.BasicReviewedActionsWorkflowImpl
DataNucleus Enhancer completed with success for 8 classes. Timings : input=156 ms, enhance=168 ms, total=324 ms. Consult the log for full details
[INFO] 
[INFO] --- maven-resources-plugin:2.6:testResources (default-testResources) @ hippo-repository-workflow ---
[INFO] Using 'UTF-8' encoding to copy filtered resources.
[INFO] Copying 9 resources
[INFO] Copying 3 resources
[INFO] 
[INFO] --- maven-compiler-plugin:2.5.1:testCompile (default-testCompile) @ hippo-repository-workflow ---
[INFO] Compiling 8 source files to <https://builds.onehippo.org/job/hippo-repository%20Trunk%20Nightly/ws/workflow/target/test-classes>
[INFO] [INFO] Tests are skipped.

[INFO] --- maven-surefire-plugin:2.12.4:test (default-test) @ hippo-repository-workflow ---
[HUDSON] Recording test results
[INFO] 
[INFO] --- maven-jar-plugin:2.4:jar (default-jar) @ hippo-repository-workflow ---
[INFO] Building jar: <https://builds.onehippo.org/job/hippo-repository%20Trunk%20Nightly/ws/workflow/target/hippo-repository-workflow-2.24.02-SNAPSHOT.jar>
mojo forkStarted org.apache.maven.plugins:maven-source-plugin:2.2.1(attach-sources)
mojo forkSucceeded org.apache.maven.plugins:maven-source-plugin:2.2.1(attach-sources)
ignoring exception during new ExecutedMojo null
[INFO] 
[INFO] --- maven-source-plugin:2.2.1:jar (attach-sources) @ hippo-repository-workflow ---
[INFO] Building jar: <https://builds.onehippo.org/job/hippo-repository%20Trunk%20Nightly/ws/workflow/target/hippo-repository-workflow-2.24.02-SNAPSHOT-sources.jar>
[INFO] [INFO] Installing <https://builds.onehippo.org/job/hippo-repository%20Trunk%20Nightly/ws/workflow/target/hippo-repository-workflow-2.24.02-SNAPSHOT.jar> to /var/hudson-data/repository/m2/org/onehippo/cms7/hippo-repository-workflow/2.24.02-SNAPSHOT/hippo-repository-workflow-2.24.02-SNAPSHOT.jar
[INFO] Installing <https://builds.onehippo.org/job/hippo-repository%20Trunk%20Nightly/ws/workflow/pom.xml> to /var/hudson-data/repository/m2/org/onehippo/cms7/hippo-repository-workflow/2.24.02-SNAPSHOT/hippo-repository-workflow-2.24.02-SNAPSHOT.pom

[INFO] --- maven-install-plugin:2.3.1:install (default-install) @ hippo-repository-workflow ---
[INFO] Installing <https://builds.onehippo.org/job/hippo-repository%20Trunk%20Nightly/ws/workflow/target/hippo-repository-workflow-2.24.02-SNAPSHOT-sources.jar> to /var/hudson-data/repository/m2/org/onehippo/cms7/hippo-repository-workflow/2.24.02-SNAPSHOT/hippo-repository-workflow-2.24.02-SNAPSHOT-sources.jar
[INFO] 
[INFO] --- maven-deploy-plugin:2.7:deploy (default-deploy) @ hippo-repository-workflow ---
Downloading: https://maven.onehippo.com/content/repositories/snapshots/org/onehippo/cms7/hippo-repository-workflow/2.24.02-SNAPSHOT/maven-metadata.xml
Downloaded: https://maven.onehippo.com/content/repositories/snapshots/org/onehippo/cms7/hippo-repository-workflow/2.24.02-SNAPSHOT/maven-metadata.xml (1018 B at 10.8 KB/sec)
Uploading: https://maven.onehippo.com/content/repositories/snapshots/org/onehippo/cms7/hippo-repository-workflow/2.24.02-SNAPSHOT/hippo-repository-workflow-2.24.02-20130128.030434-30.jar
Jan 28, 2013 4:04:34 AM org.apache.commons.httpclient.auth.AuthChallengeProcessor selectAuthScheme
INFO: basic authentication scheme selected
Jan 28, 2013 4:04:34 AM org.apache.commons.httpclient.auth.AuthChallengeProcessor selectAuthScheme
INFO: basic authentication scheme selected
Jan 28, 2013 4:04:35 AM org.apache.commons.httpclient.auth.AuthChallengeProcessor selectAuthScheme
INFO: basic authentication scheme selected
Uploaded: https://maven.onehippo.com/content/repositories/snapshots/org/onehippo/cms7/hippo-repository-workflow/2.24.02-SNAPSHOT/hippo-repository-workflow-2.24.02-20130128.030434-30.jar (167 KB at 923.4 KB/sec)
Uploading: https://maven.onehippo.com/content/repositories/snapshots/org/onehippo/cms7/hippo-repository-workflow/2.24.02-SNAPSHOT/hippo-repository-workflow-2.24.02-20130128.030434-30.pom
Jan 28, 2013 4:04:35 AM org.apache.commons.httpclient.auth.AuthChallengeProcessor selectAuthScheme
INFO: basic authentication scheme selected
Jan 28, 2013 4:04:35 AM org.apache.commons.httpclient.auth.AuthChallengeProcessor selectAuthScheme
INFO: basic authentication scheme selected
Jan 28, 2013 4:04:35 AM org.apache.commons.httpclient.auth.AuthChallengeProcessor selectAuthScheme
INFO: basic authentication scheme selected
Uploaded: https://maven.onehippo.com/content/repositories/snapshots/org/onehippo/cms7/hippo-repository-workflow/2.24.02-SNAPSHOT/hippo-repository-workflow-2.24.02-20130128.030434-30.pom (17 KB at 93.6 KB/sec)
Downloading: https://maven.onehippo.com/content/repositories/snapshots/org/onehippo/cms7/hippo-repository-workflow/maven-metadata.xml
Downloaded: https://maven.onehippo.com/content/repositories/snapshots/org/onehippo/cms7/hippo-repository-workflow/maven-metadata.xml (366 B at 4.5 KB/sec)
Uploading: https://maven.onehippo.com/content/repositories/snapshots/org/onehippo/cms7/hippo-repository-workflow/2.24.02-SNAPSHOT/maven-metadata.xml
Jan 28, 2013 4:04:35 AM org.apache.commons.httpclient.auth.AuthChallengeProcessor selectAuthScheme
INFO: basic authentication scheme selected
Jan 28, 2013 4:04:35 AM org.apache.commons.httpclient.auth.AuthChallengeProcessor selectAuthScheme
INFO: basic authentication scheme selected
Jan 28, 2013 4:04:35 AM org.apache.commons.httpclient.auth.AuthChallengeProcessor selectAuthScheme
INFO: basic authentication scheme selected
Uploaded: https://maven.onehippo.com/content/repositories/snapshots/org/onehippo/cms7/hippo-repository-workflow/2.24.02-SNAPSHOT/maven-metadata.xml (2 KB at 11.6 KB/sec)
Uploading: https://maven.onehippo.com/content/repositories/snapshots/org/onehippo/cms7/hippo-repository-workflow/maven-metadata.xml
Jan 28, 2013 4:04:35 AM org.apache.commons.httpclient.auth.AuthChallengeProcessor selectAuthScheme
INFO: basic authentication scheme selected
Jan 28, 2013 4:04:35 AM org.apache.commons.httpclient.auth.AuthChallengeProcessor selectAuthScheme
INFO: basic authentication scheme selected
Jan 28, 2013 4:04:35 AM org.apache.commons.httpclient.auth.AuthChallengeProcessor selectAuthScheme
INFO: basic authentication scheme selected
Uploaded: https://maven.onehippo.com/content/repositories/snapshots/org/onehippo/cms7/hippo-repository-workflow/maven-metadata.xml (732 B at 4.0 KB/sec)
Uploading: https://maven.onehippo.com/content/repositories/snapshots/org/onehippo/cms7/hippo-repository-workflow/2.24.02-SNAPSHOT/hippo-repository-workflow-2.24.02-20130128.030434-30-sources.jar
Jan 28, 2013 4:04:35 AM org.apache.commons.httpclient.auth.AuthChallengeProcessor selectAuthScheme
INFO: basic authentication scheme selected
Jan 28, 2013 4:04:35 AM org.apache.commons.httpclient.auth.AuthChallengeProcessor selectAuthScheme
INFO: basic authentication scheme selected
Jan 28, 2013 4:04:35 AM org.apache.commons.httpclient.auth.AuthChallengeProcessor selectAuthScheme
INFO: basic authentication scheme selected
Uploaded: https://maven.onehippo.com/content/repositories/snapshots/org/onehippo/cms7/hippo-repository-workflow/2.24.02-SNAPSHOT/hippo-repository-workflow-2.24.02-20130128.030434-30-sources.jar (106 KB at 469.8 KB/sec)
Uploading: https://maven.onehippo.com/content/repositories/snapshots/org/onehippo/cms7/hippo-repository-workflow/2.24.02-SNAPSHOT/maven-metadata.xml
Jan 28, 2013 4:04:35 AM org.apache.commons.httpclient.auth.AuthChallengeProcessor selectAuthScheme
INFO: basic authentication scheme selected
Jan 28, 2013 4:04:35 AM org.apache.commons.httpclient.auth.AuthChallengeProcessor selectAuthScheme
INFO: basic authentication scheme selected
Jan 28, 2013 4:04:36 AM org.apache.commons.httpclient.auth.AuthChallengeProcessor selectAuthScheme
INFO: basic authentication scheme selected
Uploaded: https://maven.onehippo.com/content/repositories/snapshots/org/onehippo/cms7/hippo-repository-workflow/2.24.02-SNAPSHOT/maven-metadata.xml (2 KB at 11.6 KB/sec)
projectSucceeded org.onehippo.cms7:hippo-repository-workflow:2.24.02-SNAPSHOT
[HUDSON] Archiving <https://builds.onehippo.org/job/hippo-repository%20Trunk%20Nightly/ws/workflow/pom.xml> to /var/hudson-data/jobs/hippo-repository Trunk Nightly/modules/org.onehippo.cms7$hippo-repository-workflow/builds/2013-01-28_04-02-26/archive/org.onehippo.cms7/hippo-repository-workflow/2.24.02-SNAPSHOT/pom.xml
[HUDSON] Archiving <https://builds.onehippo.org/job/hippo-repository%20Trunk%20Nightly/ws/workflow/target/hippo-repository-workflow-2.24.02-SNAPSHOT.jar> to /var/hudson-data/jobs/hippo-repository Trunk Nightly/modules/org.onehippo.cms7$hippo-repository-workflow/builds/2013-01-28_04-02-26/archive/org.onehippo.cms7/hippo-repository-workflow/2.24.02-20130128.030434-30/hippo-repository-workflow-2.24.02-SNAPSHOT.jar
[HUDSON] Archiving <https://builds.onehippo.org/job/hippo-repository%20Trunk%20Nightly/ws/workflow/target/hippo-repository-workflow-2.24.02-SNAPSHOT-sources.jar> to /var/hudson-data/jobs/hippo-repository Trunk Nightly/modules/org.onehippo.cms7$hippo-repository-workflow/builds/2013-01-28_04-02-26/archive/org.onehippo.cms7/hippo-repository-workflow/2.24.02-20130128.030434-30/hippo-repository-workflow-2.24.02-SNAPSHOT-sources.jar
[INFO]                                                                         
[INFO] ------------------------------------------------------------------------
[INFO] Building Repository Test 2.24.02-SNAPSHOT
[INFO] ------------------------------------------------------------------------
Downloading: http://maven.onehippo.com/maven2-snapshots/org/onehippo/cms7/hippo-repository-deprecated/2.24.02-SNAPSHOT/maven-metadata.xml
Downloaded: http://maven.onehippo.com/maven2-snapshots/org/onehippo/cms7/hippo-repository-deprecated/2.24.02-SNAPSHOT/maven-metadata.xml (627 B at 7.7 KB/sec)
Downloading: http://maven.onehippo.com/maven2-snapshots/org/onehippo/cms7/hippo-repository-deprecated/2.24.02-SNAPSHOT/hippo-repository-deprecated-2.24.02-SNAPSHOT.jar
projectFailed org.onehippo.cms7:hippo-repository-test:2.24.02-SNAPSHOT
[HUDSON] Archiving <https://builds.onehippo.org/job/hippo-repository%20Trunk%20Nightly/ws/test/pom.xml> to /var/hudson-data/jobs/hippo-repository Trunk Nightly/modules/org.onehippo.cms7$hippo-repository-test/builds/2013-01-28_04-02-26/archive/org.onehippo.cms7/hippo-repository-test/2.24.02-SNAPSHOT/pom.xml
sessionEnded
[INFO] ------------------------------------------------------------------------
[INFO] Reactor Summary:
[INFO] 
[INFO] Repository ........................................ SUCCESS [14.432s]
[INFO] Repository API .................................... SUCCESS [11.060s]
[INFO] Repository Utilities .............................. SUCCESS [4.264s]
[INFO] Repository Connector .............................. SUCCESS [12.684s]
[INFO] Repository Provider Module Interface .............. SUCCESS [4.144s]
[INFO] Repository Test Utilities ......................... SUCCESS [3.676s]
[INFO] Repository Builtin workflow ....................... SUCCESS [2.748s]
[INFO] Repository Engine ................................. SUCCESS [18.136s]
[INFO] Repository Default Configuration .................. SUCCESS [3.840s]
[INFO] Repository Modules ................................ SUCCESS [5.092s]
[INFO] Repository Deprecated ............................. SUCCESS [1.032s]
[INFO] Repository Deprecated Translation ................. SUCCESS [3.412s]
[INFO] Repository Upgrade Module ......................... SUCCESS [4.936s]
[INFO] Repository Workflow dropbox ....................... SUCCESS [2.492s]
[INFO] Repository workflow implementations ............... SUCCESS [5.440s]
[INFO] Repository Test ................................... FAILURE [0.212s]
[INFO] Repository Test Content ........................... SKIPPED
[INFO] Repository LDAP based Authorization ............... SKIPPED
[INFO] Repository Resources .............................. SKIPPED
[INFO] Repository Servlets ............................... SKIPPED
[INFO] Repository Dependencies ........................... SKIPPED
[INFO] ------------------------------------------------------------------------
[INFO] BUILD FAILURE
[INFO] ------------------------------------------------------------------------
[INFO] Total time: 1:45.972s
[INFO] Finished at: Mon Jan 28 04:04:36 CET 2013
[INFO] Final Memory: 18M/47M
[INFO] ------------------------------------------------------------------------
maven builder waiting
mavenExecutionResult exceptions not empty
org.apache.maven.lifecycle.LifecycleExecutionException: Failed to execute goal on project hippo-repository-test: Could not resolve dependencies for project org.onehippo.cms7:hippo-repository-test:jar:2.24.02-SNAPSHOT: Could not find artifact org.onehippo.cms7:hippo-repository-deprecated:jar:2.24.02-SNAPSHOT in hippo-maven2-snapshots (http://maven.onehippo.com/maven2-snapshots/)
	at org.apache.maven.lifecycle.internal.LifecycleDependencyResolver.getDependencies(LifecycleDependencyResolver.java:210)
	at org.apache.maven.lifecycle.internal.LifecycleDependencyResolver.resolveProjectDependencies(LifecycleDependencyResolver.java:117)
	at org.apache.maven.lifecycle.internal.MojoExecutor.ensureDependenciesAreResolved(MojoExecutor.java:258)
	at org.apache.maven.lifecycle.internal.MojoExecutor.execute(MojoExecutor.java:201)
	at org.apache.maven.lifecycle.internal.MojoExecutor.execute(MojoExecutor.java:153)
	at org.apache.maven.lifecycle.internal.MojoExecutor.execute(MojoExecutor.java:145)
	at org.apache.maven.lifecycle.internal.LifecycleModuleBuilder.buildProject(LifecycleModuleBuilder.java:84)
	at org.apache.maven.lifecycle.internal.LifecycleModuleBuilder.buildProject(LifecycleModuleBuilder.java:59)
	at org.apache.maven.lifecycle.internal.LifecycleStarter.singleThreadedBuild(LifecycleStarter.java:183)
	at org.apache.maven.lifecycle.internal.LifecycleStarter.execute(LifecycleStarter.java:161)
	at org.apache.maven.DefaultMaven.doExecute(DefaultMaven.java:320)
	at org.apache.maven.DefaultMaven.execute(DefaultMaven.java:156)
	at org.jvnet.hudson.maven3.launcher.Maven3Launcher.main(Maven3Launcher.java:79)
	at sun.reflect.NativeMethodAccessorImpl.invoke0(Native Method)
	at sun.reflect.NativeMethodAccessorImpl.invoke(NativeMethodAccessorImpl.java:39)
	at sun.reflect.DelegatingMethodAccessorImpl.invoke(DelegatingMethodAccessorImpl.java:25)
	at java.lang.reflect.Method.invoke(Method.java:597)
	at org.codehaus.plexus.classworlds.launcher.Launcher.launchStandard(Launcher.java:329)
	at org.codehaus.plexus.classworlds.launcher.Launcher.launch(Launcher.java:239)
	at org.jvnet.hudson.maven3.agent.Maven3Main.launch(Maven3Main.java:146)
	at hudson.maven.Maven3Builder.call(Maven3Builder.java:124)
	at hudson.maven.Maven3Builder.call(Maven3Builder.java:71)
	at hudson.remoting.UserRequest.perform(UserRequest.java:107)
	at hudson.remoting.UserRequest.perform(UserRequest.java:41)
	at hudson.remoting.Request$2.run(Request.java:276)
	at java.util.concurrent.Executors$RunnableAdapter.call(Executors.java:441)
	at java.util.concurrent.FutureTask$Sync.innerRun(FutureTask.java:303)
	at java.util.concurrent.FutureTask.run(FutureTask.java:138)
	at java.util.concurrent.ThreadPoolExecutor$Worker.runTask(ThreadPoolExecutor.java:886)
	at java.util.concurrent.ThreadPoolExecutor$Worker.run(ThreadPoolExecutor.java:908)
	at java.lang.Thread.run(Thread.java:662)
Caused by: org.apache.maven.project.DependencyResolutionException: Could not resolve dependencies for project org.onehippo.cms7:hippo-repository-test:jar:2.24.02-SNAPSHOT: Could not find artifact org.onehippo.cms7:hippo-repository-deprecated:jar:2.24.02-SNAPSHOT in hippo-maven2-snapshots (http://maven.onehippo.com/maven2-snapshots/)
	at org.apache.maven.project.DefaultProjectDependenciesResolver.resolve(DefaultProjectDependenciesResolver.java:189)
	at org.apache.maven.lifecycle.internal.LifecycleDependencyResolver.getDependencies(LifecycleDependencyResolver.java:185)
	... 30 more
Caused by: org.sonatype.aether.resolution.DependencyResolutionException: Could not find artifact org.onehippo.cms7:hippo-repository-deprecated:jar:2.24.02-SNAPSHOT in hippo-maven2-snapshots (http://maven.onehippo.com/maven2-snapshots/)
	at org.sonatype.aether.impl.internal.DefaultRepositorySystem.resolveDependencies(DefaultRepositorySystem.java:375)
	at org.apache.maven.project.DefaultProjectDependenciesResolver.resolve(DefaultProjectDependenciesResolver.java:183)
	... 31 more
Caused by: org.sonatype.aether.resolution.ArtifactResolutionException: Could not find artifact org.onehippo.cms7:hippo-repository-deprecated:jar:2.24.02-SNAPSHOT in hippo-maven2-snapshots (http://maven.onehippo.com/maven2-snapshots/)
	at org.sonatype.aether.impl.internal.DefaultArtifactResolver.resolve(DefaultArtifactResolver.java:538)
	at org.sonatype.aether.impl.internal.DefaultArtifactResolver.resolveArtifacts(DefaultArtifactResolver.java:216)
	at org.sonatype.aether.impl.internal.DefaultRepositorySystem.resolveDependencies(DefaultRepositorySystem.java:358)
	... 32 more
Caused by: org.sonatype.aether.transfer.ArtifactNotFoundException: Could not find artifact org.onehippo.cms7:hippo-repository-deprecated:jar:2.24.02-SNAPSHOT in hippo-maven2-snapshots (http://maven.onehippo.com/maven2-snapshots/)
	at org.sonatype.aether.connector.wagon.WagonRepositoryConnector$4.wrap(WagonRepositoryConnector.java:947)
	at org.sonatype.aether.connector.wagon.WagonRepositoryConnector$4.wrap(WagonRepositoryConnector.java:941)
	at org.sonatype.aether.connector.wagon.WagonRepositoryConnector$GetTask.run(WagonRepositoryConnector.java:669)
	at org.sonatype.aether.util.concurrency.RunnableErrorForwarder$1.run(RunnableErrorForwarder.java:60)
	... 3 more
Sending e-mails to: hippo-cms7-dev at lists.onehippo.org
channel stopped
Skipping sonar analysis due to bad build status FAILURE

--
This message is automatically generated by Hudson. 
For more information on Hudson, see: http://hudson-ci.org/


More information about the Hippo-cms7-dev mailing list