[Hippo-cms7-dev] [Hudson] Build failed in Hudson: hippo-repository Trunk #840

Hippo Public Hudson Server beheer at onehippo.com
Mon Jan 28 11:00:39 CET 2013


See <https://builds.onehippo.org/job/hippo-repository%20Trunk/840/changes>

Changes:

[Unico Hommes] REPO-593 bump patch jackrabbit

------------------------------------------
[...truncated 971 lines...]
[INFO] --- maven-clean-plugin:2.5:clean (default-clean) @ hippo-addon-wfdropbox ---
[INFO] 
[INFO] --- maven-remote-resources-plugin:1.4:process (default) @ hippo-addon-wfdropbox ---
[INFO] 
[INFO] --- maven-resources-plugin:2.6:resources (default-resources) @ hippo-addon-wfdropbox ---
[INFO] Using 'UTF-8' encoding to copy filtered resources.
[INFO] Copying 2 resources
[INFO] Copying 3 resources
[INFO] 
[INFO] --- maven-compiler-plugin:2.5.1:compile (default-compile) @ hippo-addon-wfdropbox ---
[INFO] Compiling 1 source file to <https://builds.onehippo.org/job/hippo-repository%20Trunk/ws/wfdropbox/target/classes>
[INFO] Using 'UTF-8' encoding to copy filtered resources.
[INFO] skip non existing resourceDirectory <https://builds.onehippo.org/job/hippo-repository%20Trunk/ws/wfdropbox/src/test/resources>
[INFO] 
[INFO] --- maven-resources-plugin:2.6:testResources (default-testResources) @ hippo-addon-wfdropbox ---
[INFO] Copying 3 resources
[INFO] 
[INFO] --- maven-compiler-plugin:2.5.1:testCompile (default-testCompile) @ hippo-addon-wfdropbox ---
[INFO] No sources to compile
[INFO] 
[INFO] --- maven-surefire-plugin:2.12.4:test (default-test) @ hippo-addon-wfdropbox ---
[HUDSON] Recording test results
[INFO] 
[INFO] --- maven-jar-plugin:2.4:jar (default-jar) @ hippo-addon-wfdropbox ---
[INFO] Building jar: <https://builds.onehippo.org/job/hippo-repository%20Trunk/ws/wfdropbox/target/hippo-addon-wfdropbox-2.24.02-SNAPSHOT.jar>
mojo forkStarted org.apache.maven.plugins:maven-source-plugin:2.2.1(attach-sources)
mojo forkSucceeded org.apache.maven.plugins:maven-source-plugin:2.2.1(attach-sources)
ignoring exception during new ExecutedMojo null
[INFO] 
[INFO] --- maven-source-plugin:2.2.1:jar (attach-sources) @ hippo-addon-wfdropbox ---
[INFO] Building jar: <https://builds.onehippo.org/job/hippo-repository%20Trunk/ws/wfdropbox/target/hippo-addon-wfdropbox-2.24.02-SNAPSHOT-sources.jar>
[INFO] 
[INFO] --- maven-install-plugin:2.3.1:install (default-install) @ hippo-addon-wfdropbox ---
[INFO] Installing <https://builds.onehippo.org/job/hippo-repository%20Trunk/ws/wfdropbox/target/hippo-addon-wfdropbox-2.24.02-SNAPSHOT.jar> to /var/hudson-data/repository/m2/org/onehippo/cms7/hippo-addon-wfdropbox/2.24.02-SNAPSHOT/hippo-addon-wfdropbox-2.24.02-SNAPSHOT.jar
[INFO] Installing <https://builds.onehippo.org/job/hippo-repository%20Trunk/ws/wfdropbox/pom.xml> to /var/hudson-data/repository/m2/org/onehippo/cms7/hippo-addon-wfdropbox/2.24.02-SNAPSHOT/hippo-addon-wfdropbox-2.24.02-SNAPSHOT.pom
[INFO] Installing <https://builds.onehippo.org/job/hippo-repository%20Trunk/ws/wfdropbox/target/hippo-addon-wfdropbox-2.24.02-SNAPSHOT-sources.jar> to /var/hudson-data/repository/m2/org/onehippo/cms7/hippo-addon-wfdropbox/2.24.02-SNAPSHOT/hippo-addon-wfdropbox-2.24.02-SNAPSHOT-sources.jar
projectSucceeded org.onehippo.cms7:hippo-addon-wfdropbox:2.24.02-SNAPSHOT
[HUDSON] Archiving <https://builds.onehippo.org/job/hippo-repository%20Trunk/ws/wfdropbox/pom.xml> to /var/hudson-data/jobs/hippo-repository Trunk/modules/org.onehippo.cms7$hippo-addon-wfdropbox/builds/2013-01-28_10-55-04/archive/org.onehippo.cms7/hippo-addon-wfdropbox/2.24.02-SNAPSHOT/pom.xml
[HUDSON] Archiving <https://builds.onehippo.org/job/hippo-repository%20Trunk/ws/wfdropbox/target/hippo-addon-wfdropbox-2.24.02-SNAPSHOT.jar> to /var/hudson-data/jobs/hippo-repository Trunk/modules/org.onehippo.cms7$hippo-addon-wfdropbox/builds/2013-01-28_10-55-04/archive/org.onehippo.cms7/hippo-addon-wfdropbox/2.24.02-SNAPSHOT/hippo-addon-wfdropbox-2.24.02-SNAPSHOT.jar
[HUDSON] Archiving <https://builds.onehippo.org/job/hippo-repository%20Trunk/ws/wfdropbox/target/hippo-addon-wfdropbox-2.24.02-SNAPSHOT-sources.jar> to /var/hudson-data/jobs/hippo-repository Trunk/modules/org.onehippo.cms7$hippo-addon-wfdropbox/builds/2013-01-28_10-55-04/archive/org.onehippo.cms7/hippo-addon-wfdropbox/2.24.02-SNAPSHOT/hippo-addon-wfdropbox-2.24.02-SNAPSHOT-sources.jar
[INFO]                                                                         
[INFO] ------------------------------------------------------------------------
[INFO] Building Repository workflow implementations 2.24.02-SNAPSHOT
[INFO] ------------------------------------------------------------------------
[WARNING] Failure to transfer asm:asm/maven-metadata.xml from file:../../local.repository/trunk was cached in the local repository, resolution will not be reattempted until the update interval of local.repository has elapsed or updates are forced. Original error: Could not transfer metadata asm:asm/maven-metadata.xml from/to local.repository (file:../../local.repository/trunk): No connector available to access repository local.repository (file:../../local.repository/trunk) of type legacy using the available factories WagonRepositoryConnectorFactory
Downloading: http://maven.onehippo.com/maven2-snapshots/asm/asm/maven-metadata.xml
Downloading: http://maven.onehippo.com/maven2/asm/asm/maven-metadata.xml
[INFO] 
[INFO] --- maven-clean-plugin:2.5:clean (default-clean) @ hippo-repository-workflow ---
[INFO] 
[INFO] --- maven-remote-resources-plugin:1.4:process (default) @ hippo-repository-workflow ---
[INFO] artifact asm:asm: checking for updates from hippo-maven2-snapshots
[INFO] artifact asm:asm: checking for updates from hippo
[INFO] artifact asm:asm: checking for updates from hippo-maven2
[INFO] artifact asm:asm: checking for updates from central
[INFO] artifact asm:asm: checking for updates from local.repository
[INFO] artifact asm:asm: checking for updates from DN_M2_Repo
[INFO] 
[INFO] --- maven-resources-plugin:2.6:resources (default-resources) @ hippo-repository-workflow ---
[INFO] Using 'UTF-8' encoding to copy filtered resources.
[INFO] Copying 16 resources
[INFO] Copying 3 resources
[INFO] 
[INFO] --- maven-compiler-plugin:2.5.1:compile (default-compile) @ hippo-repository-workflow ---
[INFO] Compiling 13 source files to <https://builds.onehippo.org/job/hippo-repository%20Trunk/ws/workflow/target/classes>
[INFO] 
[INFO] --- maven-datanucleus-plugin:2.2.1:enhance (default) @ hippo-repository-workflow ---
[WARNING] Failure to transfer asm:asm/maven-metadata.xml from file:../../local.repository/trunk was cached in the local repository, resolution will not be reattempted until the update interval of local.repository has elapsed or updates are forced. Original error: Could not transfer metadata asm:asm/maven-metadata.xml from/to local.repository (file:../../local.repository/trunk): No connector available to access repository local.repository (file:../../local.repository/trunk) of type legacy using the available factories WagonRepositoryConnectorFactory
[INFO]   CP: /var/hudson-data/repository/m2/org/datanucleus/maven-datanucleus-plugin/2.2.1/maven-datanucleus-plugin-2.2.1.jar
[INFO]   CP: /var/hudson-data/repository/m2/org/datanucleus/datanucleus-core/2.2.2/datanucleus-core-2.2.2.jar
[INFO]   CP: /var/hudson-data/repository/m2/javax/jcr/jcr/2.0/jcr-2.0.jar
[INFO]   CP: <https://builds.onehippo.org/job/hippo-repository%20Trunk/ws/api/target/hippo-repository-api-2.24.02-SNAPSHOT.jar>
[INFO]   CP: <https://builds.onehippo.org/job/hippo-repository%20Trunk/ws/builtin/target/hippo-repository-builtin-2.24.02-SNAPSHOT.jar>
[INFO]   CP: /var/hudson-data/repository/m2/org/slf4j/slf4j-api/1.6.4/slf4j-api-1.6.4.jar
[INFO]   CP: /var/hudson-data/repository/m2/log4j/log4j/1.2.16/log4j-1.2.16.jar
[INFO]   CP: /var/hudson-data/repository/m2/org/datanucleus/datanucleus-enhancer/2.1.3/datanucleus-enhancer-2.1.3.jar
[INFO]   CP: /var/hudson-data/repository/m2/javax/jdo/jdo-api/3.0.1/jdo-api-3.0.1.jar
[INFO]   CP: /var/hudson-data/repository/m2/javax/transaction/jta/1.1/jta-1.1.jar
[INFO]   CP: /var/hudson-data/repository/m2/org/datanucleus/datanucleus-rdbms/2.2.4/datanucleus-rdbms-2.2.4.jar
[INFO]   CP: /var/hudson-data/repository/m2/org/datanucleus/datanucleus-jpa/2.1.8/datanucleus-jpa-2.1.8.jar
[INFO]   CP: /var/hudson-data/repository/m2/org/apache/geronimo/specs/geronimo-jpa_2.0_spec/1.0/geronimo-jpa_2.0_spec-1.0.jar
[INFO]   CP: /var/hudson-data/repository/m2/asm/asm/3.3.1/asm-3.3.1.jar
[INFO]   CP: /var/hudson-data/repository/m2/org/codehaus/plexus/plexus-utils/1.2/plexus-utils-1.2.jar
[INFO]   CP: /var/hudson-data/repository/m2/junit/junit/3.8.1/junit-3.8.1.jar
[INFO]   CP: <https://builds.onehippo.org/job/hippo-repository%20Trunk/ws/workflow/target/classes>
[INFO]   CP: <https://builds.onehippo.org/job/hippo-repository%20Trunk/ws/utilities/target/hippo-repository-utilities-2.24.02-SNAPSHOT.jar>
[INFO]   CP: /var/hudson-data/repository/m2/org/apache/jackrabbit/jackrabbit-jcr-commons/2.2.13-h6/jackrabbit-jcr-commons-2.2.13-h6.jar
[INFO]   CP: /var/hudson-data/repository/m2/commons-io/commons-io/1.4/commons-io-1.4.jar
DataNucleus Enhancer (version 2.1.3) : Enhancement of classes
DataNucleus Enhancer : Classpath
>>  /var/hudson-data/plugins/maven-plugin/WEB-INF/lib/maven3-agent-2.2.2.jar
>>  /home/hudson/software/maven/apache-maven-3.0-latest/boot/plexus-classworlds-2.4.jar
ENHANCED (PersistenceCapable) : org.hippoecm.repository.reviewedactions.UnlockWorkflowImpl
ENHANCED (PersistenceCapable) : org.hippoecm.repository.reviewedactions.ScheduledRequestWorkflowImpl
ENHANCED (PersistenceCapable) : org.hippoecm.repository.reviewedactions.FullReviewedActionsWorkflowImpl
ENHANCED (PersistenceCapable) : org.hippoecm.repository.reviewedactions.PublishableDocument
ENHANCED (PersistenceCapable) : org.hippoecm.repository.reviewedactions.PublicationRequest
ENHANCED (PersistenceCapable) : org.hippoecm.repository.reviewedactions.BasicRequestWorkflowImpl
ENHANCED (PersistenceCapable) : org.hippoecm.repository.reviewedactions.FullRequestWorkflowImpl
ENHANCED (PersistenceCapable) : org.hippoecm.repository.reviewedactions.BasicReviewedActionsWorkflowImpl
DataNucleus Enhancer completed with success for 8 classes. Timings : input=140 ms, enhance=132 ms, total=272 ms. Consult the log for full details
[INFO] 
[INFO] --- maven-resources-plugin:2.6:testResources (default-testResources) @ hippo-repository-workflow ---
[INFO] Using 'UTF-8' encoding to copy filtered resources.
[INFO] Copying 9 resources
[INFO] Copying 3 resources
[INFO] 
[INFO] --- maven-compiler-plugin:2.5.1:testCompile (default-testCompile) @ hippo-repository-workflow ---
[INFO] Compiling 8 source files to <https://builds.onehippo.org/job/hippo-repository%20Trunk/ws/workflow/target/test-classes>
[INFO] 
[INFO] --- maven-surefire-plugin:2.12.4:test (default-test) @ hippo-repository-workflow ---
[INFO] Surefire report directory: <https://builds.onehippo.org/job/hippo-repository%20Trunk/ws/workflow/target/surefire-reports>

-------------------------------------------------------
 T E S T S
-------------------------------------------------------

-------------------------------------------------------
 T E S T S
-------------------------------------------------------
Running org.hippoecm.repository.reviewedactions.ReviewedActionsWorkflowTest
Tests run: 5, Failures: 0, Errors: 0, Skipped: 0, Time elapsed: 14.384 sec
Running org.hippoecm.repository.reviewedactions.FailingWorkflowTest
Tests run: 1, Failures: 0, Errors: 0, Skipped: 0, Time elapsed: 12.428 sec
Running org.hippoecm.repository.reviewedactions.VersioningWorkflowTest
Tests run: 1, Failures: 0, Errors: 0, Skipped: 0, Time elapsed: 16.18 sec
Running org.hippoecm.repository.CopyTest
Tests run: 10, Failures: 0, Errors: 0, Skipped: 0, Time elapsed: 14.492 sec
Running org.hippoecm.faceteddate.DerivedDateTest
Tests run: 6, Failures: 0, Errors: 0, Skipped: 0, Time elapsed: 14.404 sec

Results :

Tests run: 23, Failures: 0, Errors: 0, Skipped: 0

[HUDSON] Recording test results
[INFO] 
[INFO] --- maven-jar-plugin:2.4:jar (default-jar) @ hippo-repository-workflow ---
[INFO] Building jar: <https://builds.onehippo.org/job/hippo-repository%20Trunk/ws/workflow/target/hippo-repository-workflow-2.24.02-SNAPSHOT.jar>
mojo forkStarted org.apache.maven.plugins:maven-source-plugin:2.2.1(attach-sources)
mojo forkSucceeded org.apache.maven.plugins:maven-source-plugin:2.2.1(attach-sources)
ignoring exception during new ExecutedMojo null
[INFO] 
[INFO] --- maven-source-plugin:2.2.1:jar (attach-sources) @ hippo-repository-workflow ---
[INFO] Building jar: <https://builds.onehippo.org/job/hippo-repository%20Trunk/ws/workflow/target/hippo-repository-workflow-2.24.02-SNAPSHOT-sources.jar>
[INFO] [INFO] Installing <https://builds.onehippo.org/job/hippo-repository%20Trunk/ws/workflow/target/hippo-repository-workflow-2.24.02-SNAPSHOT.jar> to /var/hudson-data/repository/m2/org/onehippo/cms7/hippo-repository-workflow/2.24.02-SNAPSHOT/hippo-repository-workflow-2.24.02-SNAPSHOT.jar
[INFO] Installing <https://builds.onehippo.org/job/hippo-repository%20Trunk/ws/workflow/pom.xml> to /var/hudson-data/repository/m2/org/onehippo/cms7/hippo-repository-workflow/2.24.02-SNAPSHOT/hippo-repository-workflow-2.24.02-SNAPSHOT.pom

[INFO] --- maven-install-plugin:2.3.1:install (default-install) @ hippo-repository-workflow ---
[INFO] Installing <https://builds.onehippo.org/job/hippo-repository%20Trunk/ws/workflow/target/hippo-repository-workflow-2.24.02-SNAPSHOT-sources.jar> to /var/hudson-data/repository/m2/org/onehippo/cms7/hippo-repository-workflow/2.24.02-SNAPSHOT/hippo-repository-workflow-2.24.02-SNAPSHOT-sources.jar
projectSucceeded org.onehippo.cms7:hippo-repository-workflow:2.24.02-SNAPSHOT
[HUDSON] Archiving <https://builds.onehippo.org/job/hippo-repository%20Trunk/ws/workflow/pom.xml> to /var/hudson-data/jobs/hippo-repository Trunk/modules/org.onehippo.cms7$hippo-repository-workflow/builds/2013-01-28_10-55-04/archive/org.onehippo.cms7/hippo-repository-workflow/2.24.02-SNAPSHOT/pom.xml
[HUDSON] Archiving <https://builds.onehippo.org/job/hippo-repository%20Trunk/ws/workflow/target/hippo-repository-workflow-2.24.02-SNAPSHOT.jar> to /var/hudson-data/jobs/hippo-repository Trunk/modules/org.onehippo.cms7$hippo-repository-workflow/builds/2013-01-28_10-55-04/archive/org.onehippo.cms7/hippo-repository-workflow/2.24.02-SNAPSHOT/hippo-repository-workflow-2.24.02-SNAPSHOT.jar
[HUDSON] Archiving <https://builds.onehippo.org/job/hippo-repository%20Trunk/ws/workflow/target/hippo-repository-workflow-2.24.02-SNAPSHOT-sources.jar> to /var/hudson-data/jobs/hippo-repository Trunk/modules/org.onehippo.cms7$hippo-repository-workflow/builds/2013-01-28_10-55-04/archive/org.onehippo.cms7/hippo-repository-workflow/2.24.02-SNAPSHOT/hippo-repository-workflow-2.24.02-SNAPSHOT-sources.jar
[INFO]                                                                         
[INFO] ------------------------------------------------------------------------
[INFO] Building Repository Test 2.24.02-SNAPSHOT
[INFO] ------------------------------------------------------------------------
Downloading: http://maven.onehippo.com/maven2-snapshots/org/onehippo/cms7/hippo-repository-deprecated/2.24.02-SNAPSHOT/maven-metadata.xml
Downloaded: http://maven.onehippo.com/maven2-snapshots/org/onehippo/cms7/hippo-repository-deprecated/2.24.02-SNAPSHOT/maven-metadata.xml (627 B at 0.2 KB/sec)
Downloading: http://maven.onehippo.com/maven2-snapshots/org/onehippo/cms7/hippo-repository-deprecated/2.24.02-SNAPSHOT/hippo-repository-deprecated-2.24.02-SNAPSHOT.jar
projectFailed org.onehippo.cms7:hippo-repository-test:2.24.02-SNAPSHOT
[HUDSON] Archiving <https://builds.onehippo.org/job/hippo-repository%20Trunk/ws/test/pom.xml> to /var/hudson-data/jobs/hippo-repository Trunk/modules/org.onehippo.cms7$hippo-repository-test/builds/2013-01-28_10-55-04/archive/org.onehippo.cms7/hippo-repository-test/2.24.02-SNAPSHOT/pom.xml
sessionEnded
[INFO] ------------------------------------------------------------------------
[INFO] Reactor Summary:
[INFO] 
[INFO] Repository ........................................ SUCCESS [6.848s]
[INFO] Repository API .................................... SUCCESS [8.320s]
[INFO] Repository Utilities .............................. SUCCESS [2.644s]
[INFO] Repository Connector .............................. SUCCESS [5.680s]
[INFO] Repository Provider Module Interface .............. SUCCESS [3.536s]
[INFO] Repository Test Utilities ......................... SUCCESS [4.636s]
[INFO] Repository Builtin workflow ....................... SUCCESS [1.456s]
[INFO] Repository Engine ................................. SUCCESS [1:59.180s]
[INFO] Repository Default Configuration .................. SUCCESS [53.972s]
[INFO] Repository Modules ................................ SUCCESS [23.712s]
[INFO] Repository Deprecated ............................. SUCCESS [0.320s]
[INFO] Repository Deprecated Translation ................. SUCCESS [1.664s]
[INFO] Repository Upgrade Module ......................... SUCCESS [10.392s]
[INFO] Repository Workflow dropbox ....................... SUCCESS [1.320s]
[INFO] Repository workflow implementations ............... SUCCESS [1:16.732s]
[INFO] Repository Test ................................... FAILURE [5.016s]
[INFO] Repository Test Content ........................... SKIPPED
[INFO] Repository LDAP based Authorization ............... SKIPPED
[INFO] Repository Resources .............................. SKIPPED
[INFO] Repository Servlets ............................... SKIPPED
[INFO] Repository Dependencies ........................... SKIPPED
[INFO] ------------------------------------------------------------------------
[INFO] BUILD FAILURE
[INFO] ------------------------------------------------------------------------
[INFO] Total time: 5:30.256s
[INFO] Finished at: Mon Jan 28 11:00:36 CET 2013
[INFO] Final Memory: 21M/50M
[INFO] ------------------------------------------------------------------------
mavenExecutionResult exceptions not empty
org.apache.maven.lifecycle.LifecycleExecutionException: Failed to execute goal on project hippo-repository-test: Could not resolve dependencies for project org.onehippo.cms7:hippo-repository-test:jar:2.24.02-SNAPSHOT: Could not find artifact org.onehippo.cms7:hippo-repository-deprecated:jar:2.24.02-SNAPSHOT in hippo-maven2-snapshots (http://maven.onehippo.com/maven2-snapshots/)
	at org.apache.maven.lifecycle.internal.LifecycleDependencyResolver.getDependencies(LifecycleDependencyResolver.java:210)
	at org.apache.maven.lifecycle.internal.LifecycleDependencyResolver.resolveProjectDependencies(LifecycleDependencyResolver.java:117)
	at org.apache.maven.lifecycle.internal.MojoExecutor.ensureDependenciesAreResolved(MojoExecutor.java:258)
	at org.apache.maven.lifecycle.internal.MojoExecutor.execute(MojoExecutor.java:201)
	at org.apache.maven.lifecycle.internal.MojoExecutor.execute(MojoExecutor.java:153)
	at org.apache.maven.lifecycle.internal.MojoExecutor.execute(MojoExecutor.java:145)
	at org.apache.maven.lifecycle.internal.LifecycleModuleBuilder.buildProject(LifecycleModuleBuilder.java:84)
	at org.apache.maven.lifecycle.internal.LifecycleModuleBuilder.buildProject(LifecycleModuleBuilder.java:59)
	at org.apache.maven.lifecycle.internal.LifecycleStarter.singleThreadedBuild(LifecycleStarter.java:183)
	at org.apache.maven.lifecycle.internal.LifecycleStarter.execute(LifecycleStarter.java:161)
	at org.apache.maven.DefaultMaven.doExecute(DefaultMaven.java:320)
	at org.apache.maven.DefaultMaven.execute(DefaultMaven.java:156)
	at org.jvnet.hudson.maven3.launcher.Maven3Launcher.main(Maven3Launcher.java:79)
	at sun.reflect.NativeMethodAccessorImpl.invoke0(Native Method)
	at sun.reflect.NativeMethodAccessorImpl.invoke(NativeMethodAccessorImpl.java:39)
	at sun.reflect.DelegatingMethodAccessorImpl.invoke(DelegatingMethodAccessorImpl.java:25)
	at java.lang.reflect.Method.invoke(Method.java:597)
	at org.codehaus.plexus.classworlds.launcher.Launcher.launchStandard(Launcher.java:329)
	at org.codehaus.plexus.classworlds.launcher.Launcher.launch(Launcher.java:239)
	at org.jvnet.hudson.maven3.agent.Maven3Main.launch(Maven3Main.java:146)
	at hudson.maven.Maven3Builder.call(Maven3Builder.java:124)
	at hudson.maven.Maven3Builder.call(Maven3Builder.java:71)
	at hudson.remoting.UserRequest.perform(UserRequest.java:107)
	at hudson.remoting.UserRequest.perform(UserRequest.java:41)
	at hudson.remoting.Request$2.run(Request.java:276)
	at java.util.concurrent.Executors$RunnableAdapter.call(Executors.java:441)
	at java.util.concurrent.FutureTask$Sync.innerRun(FutureTask.java:303)
	at java.util.concurrent.FutureTask.run(FutureTask.java:138)
	at java.util.concurrent.ThreadPoolExecutor$Worker.runTask(ThreadPoolExecutor.java:886)
	at java.util.concurrent.ThreadPoolExecutor$Worker.run(ThreadPoolExecutor.java:908)
	at java.lang.Thread.run(Thread.java:662)
Caused by: org.apache.maven.project.DependencyResolutionException: Could not resolve dependencies for project org.onehippo.cms7:hippo-repository-test:jar:2.24.02-SNAPSHOT: Could not find artifact org.onehippo.cms7:hippo-repository-deprecated:jar:2.24.02-SNAPSHOT in hippo-maven2-snapshots (http://maven.onehippo.com/maven2-snapshots/)
	at org.apache.maven.project.DefaultProjectDependenciesResolver.resolve(DefaultProjectDependenciesResolver.java:189)
	at org.apache.maven.lifecycle.internal.LifecycleDependencyResolver.getDependencies(LifecycleDependencyResolver.java:185)
	... 30 more
Caused by: org.sonatype.aether.resolution.DependencyResolutionException: Could not find artifact org.onehippo.cms7:hippo-repository-deprecated:jar:2.24.02-SNAPSHOT in hippo-maven2-snapshots (http://maven.onehippo.com/maven2-snapshots/)
	at org.sonatype.aether.impl.internal.DefaultRepositorySystem.resolveDependencies(DefaultRepositorySystem.java:375)
	at org.apache.maven.project.DefaultProjectDependenciesResolver.resolve(DefaultProjectDependenciesResolver.java:183)
	... 31 more
Caused by: org.sonatype.aether.resolution.ArtifactResolutionException: Could not find artifact org.onehippo.cms7:hippo-repository-deprecated:jar:2.24.02-SNAPSHOT in hippo-maven2-snapshots (http://maven.onehippo.com/maven2-snapshots/)
	at org.sonatype.aether.impl.internal.DefaultArtifactResolver.resolve(DefaultArtifactResolver.java:538)
	at org.sonatype.aether.impl.internal.DefaultArtifactResolver.resolveArtifacts(DefaultArtifactResolver.java:216)
	at org.sonatype.aether.impl.internal.DefaultRepositorySystem.resolveDependencies(DefaultRepositorySystem.java:358)
	... 32 more
Caused by: org.sonatype.aether.transfer.ArtifactNotFoundException: Could not find artifact org.onehippo.cms7:hippo-repository-deprecated:jar:2.24.02-SNAPSHOT in hippo-maven2-snapshots (http://maven.onehippo.com/maven2-snapshots/)
	at org.sonatype.aether.connector.wagon.WagonRepositoryConnector$4.wrap(WagonRepositoryConnector.java:947)
	at org.sonatype.aether.connector.wagon.WagonRepositoryConnector$4.wrap(WagonRepositoryConnector.java:941)
	at org.sonatype.aether.connector.wagon.WagonRepositoryConnector$GetTask.run(WagonRepositoryConnector.java:669)
	at org.sonatype.aether.util.concurrency.RunnableErrorForwarder$1.run(RunnableErrorForwarder.java:60)
	... 3 more
Sending e-mails to: hippo-cms7-dev at lists.onehippo.org
channel stopped

--
This message is automatically generated by Hudson. 
For more information on Hudson, see: http://hudson-ci.org/


More information about the Hippo-cms7-dev mailing list