[Hippo-cms7-dev] [Hudson] Build failed in Hudson: hst Trunk Nightly #542

Hippo Public Hudson Server beheer at onehippo.com
Thu Jan 31 06:35:09 CET 2013


See <https://builds.onehippo.org/job/hst%20Trunk%20Nightly/542/changes>

Changes:

[Ard Schrijvers] HSTTWO-2452 support inheritance for resource bundles. Now a hierarchy of super interface is supported, where resource bundles from super interfaces are also loaded (breadth first hierarchy for resource bundles check)

[Ate Douma] CMS7-6770: cleanup and refresh LICENSE and NOTICE files
- bump to latest CMS7 project pom 19
- configure notice.project.name property for multi-module projects (which enforces that name to be used for all generated NOTICE files)

[Ard Schrijvers] HSTTWO-2442 remove unneeded ;

[Ard Schrijvers] HSTTWO-2383 log the real username

------------------------------------------
[...truncated 2353 lines...]
Jan 31, 2013 6:34:55 AM org.apache.commons.httpclient.auth.AuthChallengeProcessor selectAuthScheme
INFO: basic authentication scheme selected
Jan 31, 2013 6:34:55 AM org.apache.commons.httpclient.auth.AuthChallengeProcessor selectAuthScheme
INFO: basic authentication scheme selected
Uploaded: https://maven.onehippo.com/content/repositories/snapshots/org/onehippo/cms7/hst/client-modules/2.26.01-SNAPSHOT/maven-metadata.xml (2 KB at 3.3 KB/sec)
Uploading: https://maven.onehippo.com/content/repositories/snapshots/org/onehippo/cms7/hst/client-modules/maven-metadata.xml
Jan 31, 2013 6:34:55 AM org.apache.commons.httpclient.auth.AuthChallengeProcessor selectAuthScheme
INFO: basic authentication scheme selected
Jan 31, 2013 6:34:56 AM org.apache.commons.httpclient.auth.AuthChallengeProcessor selectAuthScheme
INFO: basic authentication scheme selected
Jan 31, 2013 6:34:56 AM org.apache.commons.httpclient.auth.AuthChallengeProcessor selectAuthScheme
INFO: basic authentication scheme selected
Uploaded: https://maven.onehippo.com/content/repositories/snapshots/org/onehippo/cms7/hst/client-modules/maven-metadata.xml (886 B at 3.4 KB/sec)
projectSucceeded org.onehippo.cms7.hst:client-modules:2.26.01-SNAPSHOT
[HUDSON] Archiving <https://builds.onehippo.org/job/hst%20Trunk%20Nightly/ws/client-modules/pom.xml> to /var/hudson-data/jobs/hst Trunk Nightly/modules/org.onehippo.cms7.hst$client-modules/builds/2013-01-31_06-32-30/archive/org.onehippo.cms7.hst/client-modules/2.26.01-SNAPSHOT/pom.xml
[INFO]                                                                         
[INFO] ------------------------------------------------------------------------
[INFO] Building Hippo Site Toolkit Client Module CMS REST Service 2.26.01-SNAPSHOT
[INFO] ------------------------------------------------------------------------
[INFO] 
[INFO] --- maven-clean-plugin:2.4.1:clean (default-clean) @ hst-cms-rest ---
[INFO] 
[INFO] --- maven-remote-resources-plugin:1.4:process (default) @ hst-cms-rest ---
[INFO] [INFO] Using 'UTF-8' encoding to copy filtered resources.
[INFO] Copying 1 resource

[INFO] --- maven-resources-plugin:2.6:resources (default-resources) @ hst-cms-rest ---
[INFO] Copying 3 resources
[INFO] 
[INFO] --- maven-compiler-plugin:2.5.1:compile (default-compile) @ hst-cms-rest ---
[INFO] Compiling 7 source files to <https://builds.onehippo.org/job/hst%20Trunk%20Nightly/ws/client-modules/cms-rest/target/classes>
[INFO] 
[INFO] --- maven-resources-plugin:2.6:testResources (default-testResources) @ hst-cms-rest ---
[INFO] Using 'UTF-8' encoding to copy filtered resources.
[INFO] Copying 0 resource
[INFO] Copying 3 resources
[INFO] Copying 3 resources
[INFO] 
[INFO] --- maven-compiler-plugin:2.5.1:testCompile (default-testCompile) @ hst-cms-rest ---
[INFO] Compiling 4 source files to <https://builds.onehippo.org/job/hst%20Trunk%20Nightly/ws/client-modules/cms-rest/target/test-classes>
[INFO] 
[INFO] --- maven-surefire-plugin:2.12.4:test (default-test) @ hst-cms-rest ---
[INFO] Tests are skipped.
[HUDSON] Recording test results
[INFO] 
[INFO] --- maven-jar-plugin:2.4:jar (default-jar) @ hst-cms-rest ---
[INFO] Building jar: <https://builds.onehippo.org/job/hst%20Trunk%20Nightly/ws/client-modules/cms-rest/target/hst-cms-rest-2.26.01-SNAPSHOT.jar>
mojo forkStarted org.apache.maven.plugins:maven-source-plugin:2.2.1(attach-sources)
mojo forkSucceeded org.apache.maven.plugins:maven-source-plugin:2.2.1(attach-sources)
ignoring exception during new ExecutedMojo null
[INFO] 
[INFO] --- maven-source-plugin:2.2.1:jar (attach-sources) @ hst-cms-rest ---
[INFO] Building jar: <https://builds.onehippo.org/job/hst%20Trunk%20Nightly/ws/client-modules/cms-rest/target/hst-cms-rest-2.26.01-SNAPSHOT-sources.jar>
[INFO] 
[INFO] --- maven-install-plugin:2.3.1:install (default-install) @ hst-cms-rest ---
[INFO] Installing <https://builds.onehippo.org/job/hst%20Trunk%20Nightly/ws/client-modules/cms-rest/target/hst-cms-rest-2.26.01-SNAPSHOT.jar> to /var/hudson-data/repository/m2/org/onehippo/cms7/hst/client-modules/hst-cms-rest/2.26.01-SNAPSHOT/hst-cms-rest-2.26.01-SNAPSHOT.jar
[INFO] Installing <https://builds.onehippo.org/job/hst%20Trunk%20Nightly/ws/client-modules/cms-rest/pom.xml> to /var/hudson-data/repository/m2/org/onehippo/cms7/hst/client-modules/hst-cms-rest/2.26.01-SNAPSHOT/hst-cms-rest-2.26.01-SNAPSHOT.pom
[INFO] Installing <https://builds.onehippo.org/job/hst%20Trunk%20Nightly/ws/client-modules/cms-rest/target/hst-cms-rest-2.26.01-SNAPSHOT-sources.jar> to /var/hudson-data/repository/m2/org/onehippo/cms7/hst/client-modules/hst-cms-rest/2.26.01-SNAPSHOT/hst-cms-rest-2.26.01-SNAPSHOT-sources.jar
[INFO] 
[INFO] --- maven-deploy-plugin:2.7:deploy (default-deploy) @ hst-cms-rest ---
Downloading: https://maven.onehippo.com/content/repositories/snapshots/org/onehippo/cms7/hst/client-modules/hst-cms-rest/2.26.01-SNAPSHOT/maven-metadata.xml
Downloaded: https://maven.onehippo.com/content/repositories/snapshots/org/onehippo/cms7/hst/client-modules/hst-cms-rest/2.26.01-SNAPSHOT/maven-metadata.xml (1 KB at 2.7 KB/sec)
Uploading: https://maven.onehippo.com/content/repositories/snapshots/org/onehippo/cms7/hst/client-modules/hst-cms-rest/2.26.01-SNAPSHOT/hst-cms-rest-2.26.01-20130131.053459-50.jar
Jan 31, 2013 6:34:59 AM org.apache.commons.httpclient.auth.AuthChallengeProcessor selectAuthScheme
INFO: basic authentication scheme selected
Jan 31, 2013 6:34:59 AM org.apache.commons.httpclient.auth.AuthChallengeProcessor selectAuthScheme
INFO: basic authentication scheme selected
Jan 31, 2013 6:34:59 AM org.apache.commons.httpclient.auth.AuthChallengeProcessor selectAuthScheme
INFO: basic authentication scheme selected
Uploaded: https://maven.onehippo.com/content/repositories/snapshots/org/onehippo/cms7/hst/client-modules/hst-cms-rest/2.26.01-SNAPSHOT/hst-cms-rest-2.26.01-20130131.053459-50.jar (52 KB at 157.1 KB/sec)
Uploading: https://maven.onehippo.com/content/repositories/snapshots/org/onehippo/cms7/hst/client-modules/hst-cms-rest/2.26.01-SNAPSHOT/hst-cms-rest-2.26.01-20130131.053459-50.pom
Jan 31, 2013 6:35:00 AM org.apache.commons.httpclient.auth.AuthChallengeProcessor selectAuthScheme
INFO: basic authentication scheme selected
Jan 31, 2013 6:35:00 AM org.apache.commons.httpclient.auth.AuthChallengeProcessor selectAuthScheme
INFO: basic authentication scheme selected
Jan 31, 2013 6:35:00 AM org.apache.commons.httpclient.auth.AuthChallengeProcessor selectAuthScheme
INFO: basic authentication scheme selected
Uploaded: https://maven.onehippo.com/content/repositories/snapshots/org/onehippo/cms7/hst/client-modules/hst-cms-rest/2.26.01-SNAPSHOT/hst-cms-rest-2.26.01-20130131.053459-50.pom (11 KB at 71.2 KB/sec)
Downloading: https://maven.onehippo.com/content/repositories/snapshots/org/onehippo/cms7/hst/client-modules/hst-cms-rest/maven-metadata.xml
Downloaded: https://maven.onehippo.com/content/repositories/snapshots/org/onehippo/cms7/hst/client-modules/hst-cms-rest/maven-metadata.xml (414 B at 1.9 KB/sec)
Uploading: https://maven.onehippo.com/content/repositories/snapshots/org/onehippo/cms7/hst/client-modules/hst-cms-rest/2.26.01-SNAPSHOT/maven-metadata.xml
Jan 31, 2013 6:35:00 AM org.apache.commons.httpclient.auth.AuthChallengeProcessor selectAuthScheme
INFO: basic authentication scheme selected
Jan 31, 2013 6:35:00 AM org.apache.commons.httpclient.auth.AuthChallengeProcessor selectAuthScheme
INFO: basic authentication scheme selected
Jan 31, 2013 6:35:00 AM org.apache.commons.httpclient.auth.AuthChallengeProcessor selectAuthScheme
INFO: basic authentication scheme selected
Uploaded: https://maven.onehippo.com/content/repositories/snapshots/org/onehippo/cms7/hst/client-modules/hst-cms-rest/2.26.01-SNAPSHOT/maven-metadata.xml (2 KB at 6.1 KB/sec)
Uploading: https://maven.onehippo.com/content/repositories/snapshots/org/onehippo/cms7/hst/client-modules/hst-cms-rest/maven-metadata.xml
Jan 31, 2013 6:35:00 AM org.apache.commons.httpclient.auth.AuthChallengeProcessor selectAuthScheme
INFO: basic authentication scheme selected
Jan 31, 2013 6:35:00 AM org.apache.commons.httpclient.auth.AuthChallengeProcessor selectAuthScheme
INFO: basic authentication scheme selected
Jan 31, 2013 6:35:01 AM org.apache.commons.httpclient.auth.AuthChallengeProcessor selectAuthScheme
INFO: basic authentication scheme selected
Uploaded: https://maven.onehippo.com/content/repositories/snapshots/org/onehippo/cms7/hst/client-modules/hst-cms-rest/maven-metadata.xml (828 B at 1.6 KB/sec)
Uploading: https://maven.onehippo.com/content/repositories/snapshots/org/onehippo/cms7/hst/client-modules/hst-cms-rest/2.26.01-SNAPSHOT/hst-cms-rest-2.26.01-20130131.053459-50-sources.jar
Jan 31, 2013 6:35:01 AM org.apache.commons.httpclient.auth.AuthChallengeProcessor selectAuthScheme
INFO: basic authentication scheme selected
Jan 31, 2013 6:35:01 AM org.apache.commons.httpclient.auth.AuthChallengeProcessor selectAuthScheme
INFO: basic authentication scheme selected
Jan 31, 2013 6:35:01 AM org.apache.commons.httpclient.auth.AuthChallengeProcessor selectAuthScheme
INFO: basic authentication scheme selected
Uploaded: https://maven.onehippo.com/content/repositories/snapshots/org/onehippo/cms7/hst/client-modules/hst-cms-rest/2.26.01-SNAPSHOT/hst-cms-rest-2.26.01-20130131.053459-50-sources.jar (42 KB at 244.3 KB/sec)
Uploading: https://maven.onehippo.com/content/repositories/snapshots/org/onehippo/cms7/hst/client-modules/hst-cms-rest/2.26.01-SNAPSHOT/maven-metadata.xml
Jan 31, 2013 6:35:01 AM org.apache.commons.httpclient.auth.AuthChallengeProcessor selectAuthScheme
INFO: basic authentication scheme selected
Jan 31, 2013 6:35:01 AM org.apache.commons.httpclient.auth.AuthChallengeProcessor selectAuthScheme
INFO: basic authentication scheme selected
Jan 31, 2013 6:35:01 AM org.apache.commons.httpclient.auth.AuthChallengeProcessor selectAuthScheme
INFO: basic authentication scheme selected
Uploaded: https://maven.onehippo.com/content/repositories/snapshots/org/onehippo/cms7/hst/client-modules/hst-cms-rest/2.26.01-SNAPSHOT/maven-metadata.xml (2 KB at 11.6 KB/sec)
projectSucceeded org.onehippo.cms7.hst.client-modules:hst-cms-rest:2.26.01-SNAPSHOT
[HUDSON] Archiving <https://builds.onehippo.org/job/hst%20Trunk%20Nightly/ws/client-modules/cms-rest/pom.xml> to /var/hudson-data/jobs/hst Trunk Nightly/modules/org.onehippo.cms7.hst.client-modules$hst-cms-rest/builds/2013-01-31_06-32-30/archive/org.onehippo.cms7.hst.client-modules/hst-cms-rest/2.26.01-SNAPSHOT/pom.xml
[HUDSON] Archiving <https://builds.onehippo.org/job/hst%20Trunk%20Nightly/ws/client-modules/cms-rest/target/hst-cms-rest-2.26.01-SNAPSHOT.jar> to /var/hudson-data/jobs/hst Trunk Nightly/modules/org.onehippo.cms7.hst.client-modules$hst-cms-rest/builds/2013-01-31_06-32-30/archive/org.onehippo.cms7.hst.client-modules/hst-cms-rest/2.26.01-20130131.053459-50/hst-cms-rest-2.26.01-SNAPSHOT.jar
[HUDSON] Archiving <https://builds.onehippo.org/job/hst%20Trunk%20Nightly/ws/client-modules/cms-rest/target/hst-cms-rest-2.26.01-SNAPSHOT-sources.jar> to /var/hudson-data/jobs/hst Trunk Nightly/modules/org.onehippo.cms7.hst.client-modules$hst-cms-rest/builds/2013-01-31_06-32-30/archive/org.onehippo.cms7.hst.client-modules/hst-cms-rest/2.26.01-20130131.053459-50/hst-cms-rest-2.26.01-SNAPSHOT-sources.jar
[INFO]                                                                         
[INFO] ------------------------------------------------------------------------
[INFO] Building Hippo Site Toolkit Client Module Page Composer 2.26.01-SNAPSHOT
[INFO] ------------------------------------------------------------------------
[INFO] 
[INFO] --- maven-clean-plugin:2.4.1:clean (default-clean) @ hst-page-composer ---
[INFO] 
[INFO] --- maven-remote-resources-plugin:1.4:process (default) @ hst-page-composer ---
[INFO] 
[INFO] --- maven-resources-plugin:2.6:resources (default-resources) @ hst-page-composer ---
[INFO] Using 'UTF-8' encoding to copy filtered resources.
[INFO] Copying 6 resources
[INFO] Copying 3 resources
[INFO] 
[INFO] --- maven-compiler-plugin:2.5.1:compile (default-compile) @ hst-page-composer ---
[INFO] Compiling 26 source files to <https://builds.onehippo.org/job/hst%20Trunk%20Nightly/ws/client-modules/page-composer/target/classes>
[INFO] 
[INFO] --- maven-resources-plugin:2.6:testResources (default-testResources) @ hst-page-composer ---
[INFO] Using 'UTF-8' encoding to copy filtered resources.
[INFO] Copying 2 resources
[INFO] Copying 11 resources
[INFO] Copying 3 resources
[INFO] 
[INFO] --- maven-compiler-plugin:2.5.1:testCompile (default-testCompile) @ hst-page-composer ---
[INFO] Compiling 6 source files to <https://builds.onehippo.org/job/hst%20Trunk%20Nightly/ws/client-modules/page-composer/target/test-classes>
mojoFailed org.apache.maven.plugins:maven-compiler-plugin:2.5.1(default-testCompile)
[INFO] -------------------------------------------------------------
[ERROR] COMPILATION ERROR : 
[INFO] -------------------------------------------------------------
[ERROR] <https://builds.onehippo.org/job/hst%20Trunk%20Nightly/ws/client-modules/page-composer/src/test/java/org/hippoecm/hst/pagecomposer/jaxrs/model/ParametersInfoProcessorTest.java>:[39,25] cannot find symbol
symbol  : class NewstyleSubInterface
location: class org.hippoecm.hst.pagecomposer.jaxrs.model.ParametersInfoProcessorTest
[INFO] 1 error
[INFO] -------------------------------------------------------------
projectFailed org.onehippo.cms7.hst.client-modules:hst-page-composer:2.26.01-SNAPSHOT
[HUDSON] Archiving <https://builds.onehippo.org/job/hst%20Trunk%20Nightly/ws/client-modules/page-composer/pom.xml> to /var/hudson-data/jobs/hst Trunk Nightly/modules/org.onehippo.cms7.hst.client-modules$hst-page-composer/builds/2013-01-31_06-32-30/archive/org.onehippo.cms7.hst.client-modules/hst-page-composer/2.26.01-SNAPSHOT/pom.xml
sessionEnded
[INFO] ------------------------------------------------------------------------
[INFO] Reactor Summary:
[INFO] 
[INFO] Hippo Site Toolkit ................................ SUCCESS [4.076s]
[INFO] Hippo Site Toolkit API ............................ SUCCESS [10.392s]
[INFO] Hippo Site Toolkit Mock ........................... SUCCESS [5.572s]
[INFO] Hippo Site Toolkit Commons ........................ SUCCESS [8.428s]
[INFO] Hippo Site Toolkit Resources ...................... SUCCESS [1.652s]
[INFO] Hippo Site Toolkit Addon Resources ................ SUCCESS [2.028s]
[INFO] Hippo Site Toolkit CND Addon Resources ............ SUCCESS [1.616s]
[INFO] Hippo Site Toolkit CND Addon Resources ............ SUCCESS [4.632s]
[INFO] Hippo Site Toolkit Addon Resources to the Repository  SUCCESS [2.632s]
[INFO] Hippo Site Toolkit Addon Resources to the Repository for Unit Tests  SUCCESS [3.428s]
[INFO] Hippo Site Toolkit Test ........................... SUCCESS [13.004s]
[INFO] Hippo Site Toolkit Content Beans .................. SUCCESS [6.312s]
[INFO] Hippo Site Toolkit Solr Content Beans ............. SUCCESS [6.752s]
[INFO] Hippo Site Toolkit Components ..................... SUCCESS [1.548s]
[INFO] Hippo Site Toolkit Content Rewriter Component ..... SUCCESS [4.844s]
[INFO] Hippo Site Toolkit JCR Session Pool Component ..... SUCCESS [5.408s]
[INFO] Hippo Site Toolkit ResourceBundle CND ............. SUCCESS [2.852s]
[INFO] Hippo Site Toolkit ResourceBundle Component ....... SUCCESS [4.888s]
[INFO] Hippo Site Toolkit Core Component ................. SUCCESS [13.292s]
[INFO] Hippo Site Toolkit Client ......................... SUCCESS [6.892s]
[INFO] Hippo Site Toolkit Solr Content Beans ............. SUCCESS [4.324s]
[INFO] Hippo Site Toolkit Security Component ............. SUCCESS [5.628s]
[INFO] Hippo Site Toolkit JAX-RS Services Component ...... SUCCESS [7.816s]
[INFO] Hippo Site Toolkit REST Models .................... SUCCESS [4.900s]
[INFO] Hippo Site Toolkit Client Modules ................. SUCCESS [2.548s]
[INFO] Hippo Site Toolkit Client Module CMS REST Service . SUCCESS [5.424s]
[INFO] Hippo Site Toolkit Client Module Page Composer .... FAILURE [3.492s]
[INFO] Hippo Site Toolkit Client Module Google Analytics . SKIPPED
[INFO] Hippo Site Toolkit Client Module Google Analytics HST  SKIPPED
[INFO] Hippo Site Toolkit Client Module Google Analytics Repository  SKIPPED
[INFO] Hippo Site Toolkit Dependencies ................... SKIPPED
[INFO] Hippo Site Toolkit Dependencies For Spring Framework  SKIPPED
[INFO] Hippo Site Toolkit Dependencies For Server ........ SKIPPED
[INFO] Hippo Site Toolkit Dependencies For Client ........ SKIPPED
[INFO] Hippo Site Toolkit Dependencies For CMS ........... SKIPPED
[INFO] Hippo Site Toolkit Dependencies For Repository .... SKIPPED
[INFO] Hippo Site Toolkit Sandbox for Experimental Components  SKIPPED
[INFO] Hippo Site Toolkit OCM ............................ SKIPPED
[INFO] ------------------------------------------------------------------------
[INFO] BUILD FAILURE
[INFO] ------------------------------------------------------------------------
[INFO] Total time: 2:32.220s
[INFO] Finished at: Thu Jan 31 06:35:05 CET 2013
[INFO] Final Memory: 33M/78M
[INFO] ------------------------------------------------------------------------
maven builder waiting
mavenExecutionResult exceptions not empty
org.apache.maven.lifecycle.LifecycleExecutionException: Failed to execute goal org.apache.maven.plugins:maven-compiler-plugin:2.5.1:testCompile (default-testCompile) on project hst-page-composer: Compilation failure
<https://builds.onehippo.org/job/hst%20Trunk%20Nightly/ws/client-modules/page-composer/src/test/java/org/hippoecm/hst/pagecomposer/jaxrs/model/ParametersInfoProcessorTest.java>:[39,25] cannot find symbol
symbol  : class NewstyleSubInterface
location: class org.hippoecm.hst.pagecomposer.jaxrs.model.ParametersInfoProcessorTest

	at org.apache.maven.lifecycle.internal.MojoExecutor.execute(MojoExecutor.java:213)
	at org.apache.maven.lifecycle.internal.MojoExecutor.execute(MojoExecutor.java:153)
	at org.apache.maven.lifecycle.internal.MojoExecutor.execute(MojoExecutor.java:145)
	at org.apache.maven.lifecycle.internal.LifecycleModuleBuilder.buildProject(LifecycleModuleBuilder.java:84)
	at org.apache.maven.lifecycle.internal.LifecycleModuleBuilder.buildProject(LifecycleModuleBuilder.java:59)
	at org.apache.maven.lifecycle.internal.LifecycleStarter.singleThreadedBuild(LifecycleStarter.java:183)
	at org.apache.maven.lifecycle.internal.LifecycleStarter.execute(LifecycleStarter.java:161)
	at org.apache.maven.DefaultMaven.doExecute(DefaultMaven.java:320)
	at org.apache.maven.DefaultMaven.execute(DefaultMaven.java:156)
	at org.jvnet.hudson.maven3.launcher.Maven3Launcher.main(Maven3Launcher.java:79)
	at sun.reflect.NativeMethodAccessorImpl.invoke0(Native Method)
	at sun.reflect.NativeMethodAccessorImpl.invoke(NativeMethodAccessorImpl.java:39)
	at sun.reflect.DelegatingMethodAccessorImpl.invoke(DelegatingMethodAccessorImpl.java:25)
	at java.lang.reflect.Method.invoke(Method.java:597)
	at org.codehaus.plexus.classworlds.launcher.Launcher.launchStandard(Launcher.java:329)
	at org.codehaus.plexus.classworlds.launcher.Launcher.launch(Launcher.java:239)
	at org.jvnet.hudson.maven3.agent.Maven3Main.launch(Maven3Main.java:146)
	at hudson.maven.Maven3Builder.call(Maven3Builder.java:124)
	at hudson.maven.Maven3Builder.call(Maven3Builder.java:71)
	at hudson.remoting.UserRequest.perform(UserRequest.java:107)
	at hudson.remoting.UserRequest.perform(UserRequest.java:41)
	at hudson.remoting.Request$2.run(Request.java:276)
	at java.util.concurrent.Executors$RunnableAdapter.call(Executors.java:441)
	at java.util.concurrent.FutureTask$Sync.innerRun(FutureTask.java:303)
	at java.util.concurrent.FutureTask.run(FutureTask.java:138)
	at java.util.concurrent.ThreadPoolExecutor$Worker.runTask(ThreadPoolExecutor.java:886)
	at java.util.concurrent.ThreadPoolExecutor$Worker.run(ThreadPoolExecutor.java:908)
	at java.lang.Thread.run(Thread.java:662)
Caused by: org.apache.maven.plugin.CompilationFailureException: Compilation failure
<https://builds.onehippo.org/job/hst%20Trunk%20Nightly/ws/client-modules/page-composer/src/test/java/org/hippoecm/hst/pagecomposer/jaxrs/model/ParametersInfoProcessorTest.java>:[39,25] cannot find symbol
symbol  : class NewstyleSubInterface
location: class org.hippoecm.hst.pagecomposer.jaxrs.model.ParametersInfoProcessorTest

	at org.apache.maven.plugin.AbstractCompilerMojo.execute(AbstractCompilerMojo.java:729)
	at org.apache.maven.plugin.TestCompilerMojo.execute(TestCompilerMojo.java:161)
	at org.apache.maven.plugin.DefaultBuildPluginManager.executeMojo(DefaultBuildPluginManager.java:101)
	at org.apache.maven.lifecycle.internal.MojoExecutor.execute(MojoExecutor.java:209)
	... 27 more
Sending e-mails to: hippo-cms7-dev at lists.onehippo.org
channel stopped
Skipping sonar analysis due to bad build status FAILURE

--
This message is automatically generated by Hudson. 
For more information on Hudson, see: http://hudson-ci.org/


More information about the Hippo-cms7-dev mailing list