[Hippo-cms7-dev] [Hudson] Build failed in Hudson: hippo-repository Trunk #961

Hippo Public Hudson Server beheer at onehippo.com
Mon May 27 11:55:25 CEST 2013


See <https://builds.onehippo.org/job/hippo-repository%20Trunk/961/changes>

Changes:

[Unico Hommes] REPO-664 upgrade to Jackrabbit 2.6.2

------------------------------------------
[...truncated 167 lines...]

-------------------------------------------------------
 T E S T S
-------------------------------------------------------
Running org.hippoecm.repository.api.UriEncodingTest
Tests run: 3, Failures: 0, Errors: 0, Skipped: 0, Time elapsed: 0.036 sec

Results :

Tests run: 3, Failures: 0, Errors: 0, Skipped: 0

[HUDSON] Recording test results
[INFO] 
[INFO] --- maven-jar-plugin:2.4:jar (default-jar) @ hippo-repository-api ---
[INFO] Building jar: <https://builds.onehippo.org/job/hippo-repository%20Trunk/ws/api/target/hippo-repository-api-2.25.01-SNAPSHOT.jar>
mojo forkStarted org.apache.maven.plugins:maven-source-plugin:2.2.1(attach-sources)
mojo forkSucceeded org.apache.maven.plugins:maven-source-plugin:2.2.1(attach-sources)
ignoring exception during new ExecutedMojo null
[INFO] 
[INFO] --- maven-source-plugin:2.2.1:jar (attach-sources) @ hippo-repository-api ---
[INFO] Building jar: <https://builds.onehippo.org/job/hippo-repository%20Trunk/ws/api/target/hippo-repository-api-2.25.01-SNAPSHOT-sources.jar>
[INFO] 
[INFO] [INFO] Installing <https://builds.onehippo.org/job/hippo-repository%20Trunk/ws/api/target/hippo-repository-api-2.25.01-SNAPSHOT.jar> to /var/hudson-data/repository/m2/org/onehippo/cms7/hippo-repository-api/2.25.01-SNAPSHOT/hippo-repository-api-2.25.01-SNAPSHOT.jar
[INFO] Installing <https://builds.onehippo.org/job/hippo-repository%20Trunk/ws/api/pom.xml> to /var/hudson-data/repository/m2/org/onehippo/cms7/hippo-repository-api/2.25.01-SNAPSHOT/hippo-repository-api-2.25.01-SNAPSHOT.pom
[INFO] Installing <https://builds.onehippo.org/job/hippo-repository%20Trunk/ws/api/target/hippo-repository-api-2.25.01-SNAPSHOT-sources.jar> to /var/hudson-data/repository/m2/org/onehippo/cms7/hippo-repository-api/2.25.01-SNAPSHOT/hippo-repository-api-2.25.01-SNAPSHOT-sources.jar
--- maven-install-plugin:2.3.1:install (default-install) @ hippo-repository-api ---
projectSucceeded org.onehippo.cms7:hippo-repository-api:2.25.01-SNAPSHOT
[HUDSON] Archiving <https://builds.onehippo.org/job/hippo-repository%20Trunk/ws/api/pom.xml> to /var/hudson-data/jobs/hippo-repository Trunk/modules/org.onehippo.cms7$hippo-repository-api/builds/2013-05-27_11-54-38/archive/org.onehippo.cms7/hippo-repository-api/2.25.01-SNAPSHOT/pom.xml
[HUDSON] Archiving <https://builds.onehippo.org/job/hippo-repository%20Trunk/ws/api/target/hippo-repository-api-2.25.01-SNAPSHOT.jar> to /var/hudson-data/jobs/hippo-repository Trunk/modules/org.onehippo.cms7$hippo-repository-api/builds/2013-05-27_11-54-38/archive/org.onehippo.cms7/hippo-repository-api/2.25.01-SNAPSHOT/hippo-repository-api-2.25.01-SNAPSHOT.jar
[HUDSON] Archiving <https://builds.onehippo.org/job/hippo-repository%20Trunk/ws/api/target/hippo-repository-api-2.25.01-SNAPSHOT-sources.jar> to /var/hudson-data/jobs/hippo-repository Trunk/modules/org.onehippo.cms7$hippo-repository-api/builds/2013-05-27_11-54-38/archive/org.onehippo.cms7/hippo-repository-api/2.25.01-SNAPSHOT/hippo-repository-api-2.25.01-SNAPSHOT-sources.jar
[INFO]                                                                         
[INFO] ------------------------------------------------------------------------
[INFO] Building Repository Utilities 2.25.01-SNAPSHOT
[INFO] ------------------------------------------------------------------------
[INFO] 
[INFO] --- maven-clean-plugin:2.5:clean (default-clean) @ hippo-repository-utilities ---
[INFO] 
[INFO] --- maven-remote-resources-plugin:1.4:process (default) @ hippo-repository-utilities ---
[INFO] Using 'UTF-8' encoding to copy filtered resources.
[INFO] skip non existing resourceDirectory <https://builds.onehippo.org/job/hippo-repository%20Trunk/ws/utilities/src/main/resources>
[INFO] 
[INFO] --- maven-resources-plugin:2.6:resources (default-resources) @ hippo-repository-utilities ---[INFO] Copying 3 resources

[INFO] 
[INFO] --- maven-compiler-plugin:2.5.1:compile (default-compile) @ hippo-repository-utilities ---
[INFO] Compiling 5 source files to <https://builds.onehippo.org/job/hippo-repository%20Trunk/ws/utilities/target/classes>
[INFO] 
[INFO] --- maven-resources-plugin:2.6:testResources (default-testResources) @ hippo-repository-utilities ---
[INFO] Using 'UTF-8' encoding to copy filtered resources.
[INFO] skip non existing resourceDirectory <https://builds.onehippo.org/job/hippo-repository%20Trunk/ws/utilities/src/test/resources>
[INFO] Copying 3 resources
[INFO] 
[INFO] --- maven-compiler-plugin:2.5.1:testCompile (default-testCompile) @ hippo-repository-utilities ---
[INFO] Compiling 1 source file to <https://builds.onehippo.org/job/hippo-repository%20Trunk/ws/utilities/target/test-classes>
[INFO] 
[INFO] --- maven-surefire-plugin:2.12.4:test (default-test) @ hippo-repository-utilities ---
[INFO] Surefire report directory: <https://builds.onehippo.org/job/hippo-repository%20Trunk/ws/utilities/target/surefire-reports>

-------------------------------------------------------
 T E S T S
-------------------------------------------------------
Running org.hippoecm.repository.util.RepoUtilsTest
Tests run: 1, Failures: 0, Errors: 0, Skipped: 0, Time elapsed: 0.048 sec

Results :

Tests run: 1, Failures: 0, Errors: 0, Skipped: 0

[HUDSON] Recording test results
[INFO] 
[INFO] --- maven-jar-plugin:2.4:jar (default-jar) @ hippo-repository-utilities ---
[INFO] Building jar: <https://builds.onehippo.org/job/hippo-repository%20Trunk/ws/utilities/target/hippo-repository-utilities-2.25.01-SNAPSHOT.jar>
mojo forkStarted org.apache.maven.plugins:maven-source-plugin:2.2.1(attach-sources)
mojo forkSucceeded org.apache.maven.plugins:maven-source-plugin:2.2.1(attach-sources)
ignoring exception during new ExecutedMojo null
[INFO] 
[INFO] --- maven-source-plugin:2.2.1:jar (attach-sources) @ hippo-repository-utilities ---
[INFO] Building jar: <https://builds.onehippo.org/job/hippo-repository%20Trunk/ws/utilities/target/hippo-repository-utilities-2.25.01-SNAPSHOT-sources.jar>
[INFO] [INFO] Installing <https://builds.onehippo.org/job/hippo-repository%20Trunk/ws/utilities/target/hippo-repository-utilities-2.25.01-SNAPSHOT.jar> to /var/hudson-data/repository/m2/org/onehippo/cms7/hippo-repository-utilities/2.25.01-SNAPSHOT/hippo-repository-utilities-2.25.01-SNAPSHOT.jar
[INFO] Installing <https://builds.onehippo.org/job/hippo-repository%20Trunk/ws/utilities/pom.xml> to /var/hudson-data/repository/m2/org/onehippo/cms7/hippo-repository-utilities/2.25.01-SNAPSHOT/hippo-repository-utilities-2.25.01-SNAPSHOT.pom
[INFO] Installing <https://builds.onehippo.org/job/hippo-repository%20Trunk/ws/utilities/target/hippo-repository-utilities-2.25.01-SNAPSHOT-sources.jar> to /var/hudson-data/repository/m2/org/onehippo/cms7/hippo-repository-utilities/2.25.01-SNAPSHOT/hippo-repository-utilities-2.25.01-SNAPSHOT-sources.jar

[INFO] --- maven-install-plugin:2.3.1:install (default-install) @ hippo-repository-utilities ---
projectSucceeded org.onehippo.cms7:hippo-repository-utilities:2.25.01-SNAPSHOT
[HUDSON] Archiving <https://builds.onehippo.org/job/hippo-repository%20Trunk/ws/utilities/pom.xml> to /var/hudson-data/jobs/hippo-repository Trunk/modules/org.onehippo.cms7$hippo-repository-utilities/builds/2013-05-27_11-54-38/archive/org.onehippo.cms7/hippo-repository-utilities/2.25.01-SNAPSHOT/pom.xml
[HUDSON] Archiving <https://builds.onehippo.org/job/hippo-repository%20Trunk/ws/utilities/target/hippo-repository-utilities-2.25.01-SNAPSHOT.jar> to /var/hudson-data/jobs/hippo-repository Trunk/modules/org.onehippo.cms7$hippo-repository-utilities/builds/2013-05-27_11-54-38/archive/org.onehippo.cms7/hippo-repository-utilities/2.25.01-SNAPSHOT/hippo-repository-utilities-2.25.01-SNAPSHOT.jar
[HUDSON] Archiving <https://builds.onehippo.org/job/hippo-repository%20Trunk/ws/utilities/target/hippo-repository-utilities-2.25.01-SNAPSHOT-sources.jar> to /var/hudson-data/jobs/hippo-repository Trunk/modules/org.onehippo.cms7$hippo-repository-utilities/builds/2013-05-27_11-54-38/archive/org.onehippo.cms7/hippo-repository-utilities/2.25.01-SNAPSHOT/hippo-repository-utilities-2.25.01-SNAPSHOT-sources.jar
[INFO]                                                                         
[INFO] ------------------------------------------------------------------------
[INFO] Building Repository Connector 2.25.01-SNAPSHOT
[INFO] ------------------------------------------------------------------------
Downloading: http://maven.onehippo.com/maven2-snapshots/org/apache/jackrabbit/jackrabbit-api/2.6.2/jackrabbit-api-2.6.2.pom
Downloading: http://maven.onehippo.com/maven2/org/apache/jackrabbit/jackrabbit-api/2.6.2/jackrabbit-api-2.6.2.pom
Downloading: http://maven.onehippo.com/maven2/org/apache/jackrabbit/jackrabbit-api/2.6.2/jackrabbit-api-2.6.2.pom
Downloading: http://repo.maven.apache.org/maven2/org/apache/jackrabbit/jackrabbit-api/2.6.2/jackrabbit-api-2.6.2.pom
[WARNING] The POM for org.apache.jackrabbit:jackrabbit-api:jar:2.6.2 is missing, no dependency information available
Downloading: http://maven.onehippo.com/maven2-snapshots/org/apache/jackrabbit/jackrabbit-jcr-rmi/2.6.2/jackrabbit-jcr-rmi-2.6.2.pom
Downloading: http://maven.onehippo.com/maven2/org/apache/jackrabbit/jackrabbit-jcr-rmi/2.6.2/jackrabbit-jcr-rmi-2.6.2.pom
Downloading: http://maven.onehippo.com/maven2/org/apache/jackrabbit/jackrabbit-jcr-rmi/2.6.2/jackrabbit-jcr-rmi-2.6.2.pom
Downloading: http://repo.maven.apache.org/maven2/org/apache/jackrabbit/jackrabbit-jcr-rmi/2.6.2/jackrabbit-jcr-rmi-2.6.2.pom
[WARNING] The POM for org.apache.jackrabbit:jackrabbit-jcr-rmi:jar:2.6.2 is missing, no dependency information available
Downloading: http://maven.onehippo.com/maven2-snapshots/org/apache/jackrabbit/jackrabbit-core/2.6.2-h1/jackrabbit-core-2.6.2-h1.pom
Downloading: http://maven.onehippo.com/maven2/org/apache/jackrabbit/jackrabbit-core/2.6.2-h1/jackrabbit-core-2.6.2-h1.pom
Downloaded: http://maven.onehippo.com/maven2/org/apache/jackrabbit/jackrabbit-core/2.6.2-h1/jackrabbit-core-2.6.2-h1.pom (23 KB at 313.0 KB/sec)
Downloading: http://maven.onehippo.com/maven2-snapshots/org/apache/jackrabbit/jackrabbit-parent/2.6.2-h1/jackrabbit-parent-2.6.2-h1.pom
Downloading: http://maven.onehippo.com/maven2/org/apache/jackrabbit/jackrabbit-parent/2.6.2-h1/jackrabbit-parent-2.6.2-h1.pom
Downloaded: http://maven.onehippo.com/maven2/org/apache/jackrabbit/jackrabbit-parent/2.6.2-h1/jackrabbit-parent-2.6.2-h1.pom (30 KB at 332.7 KB/sec)
Downloading: http://maven.onehippo.com/maven2-snapshots/org/apache/jackrabbit/jackrabbit-jcr-commons/2.6.2/jackrabbit-jcr-commons-2.6.2.pom
Downloading: http://maven.onehippo.com/maven2/org/apache/jackrabbit/jackrabbit-jcr-commons/2.6.2/jackrabbit-jcr-commons-2.6.2.pom
Downloading: http://maven.onehippo.com/maven2/org/apache/jackrabbit/jackrabbit-jcr-commons/2.6.2/jackrabbit-jcr-commons-2.6.2.pom
Downloading: http://repo.maven.apache.org/maven2/org/apache/jackrabbit/jackrabbit-jcr-commons/2.6.2/jackrabbit-jcr-commons-2.6.2.pom
[WARNING] The POM for org.apache.jackrabbit:jackrabbit-jcr-commons:jar:2.6.2 is missing, no dependency information available
Downloading: http://maven.onehippo.com/maven2-snapshots/org/apache/jackrabbit/jackrabbit-spi-commons/2.6.2-h1/jackrabbit-spi-commons-2.6.2-h1.pom
Downloading: http://maven.onehippo.com/maven2/org/apache/jackrabbit/jackrabbit-spi-commons/2.6.2-h1/jackrabbit-spi-commons-2.6.2-h1.pom
Downloaded: http://maven.onehippo.com/maven2/org/apache/jackrabbit/jackrabbit-spi-commons/2.6.2-h1/jackrabbit-spi-commons-2.6.2-h1.pom (7 KB at 86.3 KB/sec)
Downloading: http://maven.onehippo.com/maven2-snapshots/org/apache/jackrabbit/jackrabbit-spi/2.6.2/jackrabbit-spi-2.6.2.pom
Downloading: http://maven.onehippo.com/maven2/org/apache/jackrabbit/jackrabbit-spi/2.6.2/jackrabbit-spi-2.6.2.pom
Downloading: http://maven.onehippo.com/maven2/org/apache/jackrabbit/jackrabbit-spi/2.6.2/jackrabbit-spi-2.6.2.pom
Downloading: http://repo.maven.apache.org/maven2/org/apache/jackrabbit/jackrabbit-spi/2.6.2/jackrabbit-spi-2.6.2.pom
[WARNING] The POM for org.apache.jackrabbit:jackrabbit-spi:jar:2.6.2 is missing, no dependency information available
Downloading: http://maven.onehippo.com/maven2-snapshots/org/apache/jackrabbit/jackrabbit-jcr2spi/2.6.2/jackrabbit-jcr2spi-2.6.2.pom
Downloading: http://maven.onehippo.com/maven2/org/apache/jackrabbit/jackrabbit-jcr2spi/2.6.2/jackrabbit-jcr2spi-2.6.2.pom
Downloading: http://maven.onehippo.com/maven2/org/apache/jackrabbit/jackrabbit-jcr2spi/2.6.2/jackrabbit-jcr2spi-2.6.2.pom
Downloading: http://repo.maven.apache.org/maven2/org/apache/jackrabbit/jackrabbit-jcr2spi/2.6.2/jackrabbit-jcr2spi-2.6.2.pom
[WARNING] The POM for org.apache.jackrabbit:jackrabbit-jcr2spi:jar:2.6.2 is missing, no dependency information available
Downloading: http://maven.onehippo.com/maven2-snapshots/org/apache/jackrabbit/jackrabbit-spi2jcr/2.6.2/jackrabbit-spi2jcr-2.6.2.pom
Downloading: http://maven.onehippo.com/maven2/org/apache/jackrabbit/jackrabbit-spi2jcr/2.6.2/jackrabbit-spi2jcr-2.6.2.pom
Downloading: http://maven.onehippo.com/maven2/org/apache/jackrabbit/jackrabbit-spi2jcr/2.6.2/jackrabbit-spi2jcr-2.6.2.pom
Downloading: http://repo.maven.apache.org/maven2/org/apache/jackrabbit/jackrabbit-spi2jcr/2.6.2/jackrabbit-spi2jcr-2.6.2.pom
[WARNING] The POM for org.apache.jackrabbit:jackrabbit-spi2jcr:jar:2.6.2 is missing, no dependency information available
Downloading: http://maven.onehippo.com/maven2-snapshots/org/apache/jackrabbit/jackrabbit-api/2.6.2/jackrabbit-api-2.6.2.jar
Downloading: http://maven.onehippo.com/maven2-snapshots/org/apache/jackrabbit/jackrabbit-jcr-rmi/2.6.2/jackrabbit-jcr-rmi-2.6.2.jar
Downloading: http://maven.onehippo.com/maven2-snapshots/org/apache/jackrabbit/jackrabbit-jcr-commons/2.6.2/jackrabbit-jcr-commons-2.6.2.jar
Downloading: http://maven.onehippo.com/maven2-snapshots/org/apache/jackrabbit/jackrabbit-spi/2.6.2/jackrabbit-spi-2.6.2.jar
Downloading: http://maven.onehippo.com/maven2-snapshots/org/apache/jackrabbit/jackrabbit-core/2.6.2-h1/jackrabbit-core-2.6.2-h1.jar
Downloading: http://maven.onehippo.com/maven2-snapshots/org/apache/jackrabbit/jackrabbit-jcr2spi/2.6.2/jackrabbit-jcr2spi-2.6.2.jar
Downloading: http://maven.onehippo.com/maven2-snapshots/org/apache/jackrabbit/jackrabbit-spi2jcr/2.6.2/jackrabbit-spi2jcr-2.6.2.jar
Downloading: http://maven.onehippo.com/maven2-snapshots/org/apache/jackrabbit/jackrabbit-spi-commons/2.6.2-h1/jackrabbit-spi-commons-2.6.2-h1.jar
Downloading: http://maven.onehippo.com/maven2/org/apache/jackrabbit/jackrabbit-api/2.6.2/jackrabbit-api-2.6.2.jar
Downloading: http://maven.onehippo.com/maven2/org/apache/jackrabbit/jackrabbit-jcr-rmi/2.6.2/jackrabbit-jcr-rmi-2.6.2.jar
Downloading: http://maven.onehippo.com/maven2/org/apache/jackrabbit/jackrabbit-core/2.6.2-h1/jackrabbit-core-2.6.2-h1.jar
Downloading: http://maven.onehippo.com/maven2/org/apache/jackrabbit/jackrabbit-jcr-commons/2.6.2/jackrabbit-jcr-commons-2.6.2.jar
Downloading: http://maven.onehippo.com/maven2/org/apache/jackrabbit/jackrabbit-spi/2.6.2/jackrabbit-spi-2.6.2.jar
Downloading: http://maven.onehippo.com/maven2/org/apache/jackrabbit/jackrabbit-jcr2spi/2.6.2/jackrabbit-jcr2spi-2.6.2.jar
Downloading: http://maven.onehippo.com/maven2/org/apache/jackrabbit/jackrabbit-spi2jcr/2.6.2/jackrabbit-spi2jcr-2.6.2.jar
Downloading: http://maven.onehippo.com/maven2/org/apache/jackrabbit/jackrabbit-spi-commons/2.6.2-h1/jackrabbit-spi-commons-2.6.2-h1.jar
Downloaded: http://maven.onehippo.com/maven2/org/apache/jackrabbit/jackrabbit-spi-commons/2.6.2-h1/jackrabbit-spi-commons-2.6.2-h1.jar (769 KB at 4269.4 KB/sec)
Downloaded: http://maven.onehippo.com/maven2/org/apache/jackrabbit/jackrabbit-core/2.6.2-h1/jackrabbit-core-2.6.2-h1.jar (2372 KB at 5439.7 KB/sec)
Downloading: http://maven.onehippo.com/maven2/org/apache/jackrabbit/jackrabbit-api/2.6.2/jackrabbit-api-2.6.2.jar
Downloading: http://maven.onehippo.com/maven2/org/apache/jackrabbit/jackrabbit-jcr-rmi/2.6.2/jackrabbit-jcr-rmi-2.6.2.jar
Downloading: http://maven.onehippo.com/maven2/org/apache/jackrabbit/jackrabbit-jcr-commons/2.6.2/jackrabbit-jcr-commons-2.6.2.jar
Downloading: http://maven.onehippo.com/maven2/org/apache/jackrabbit/jackrabbit-spi/2.6.2/jackrabbit-spi-2.6.2.jar
Downloading: http://maven.onehippo.com/maven2/org/apache/jackrabbit/jackrabbit-jcr2spi/2.6.2/jackrabbit-jcr2spi-2.6.2.jar
Downloading: http://maven.onehippo.com/maven2/org/apache/jackrabbit/jackrabbit-spi2jcr/2.6.2/jackrabbit-spi2jcr-2.6.2.jar
Downloading: http://repo.maven.apache.org/maven2/org/apache/jackrabbit/jackrabbit-api/2.6.2/jackrabbit-api-2.6.2.jar
Downloading: http://repo.maven.apache.org/maven2/org/apache/jackrabbit/jackrabbit-jcr-rmi/2.6.2/jackrabbit-jcr-rmi-2.6.2.jar
Downloading: http://repo.maven.apache.org/maven2/org/apache/jackrabbit/jackrabbit-spi/2.6.2/jackrabbit-spi-2.6.2.jar
Downloading: http://repo.maven.apache.org/maven2/org/apache/jackrabbit/jackrabbit-jcr2spi/2.6.2/jackrabbit-jcr2spi-2.6.2.jar
Downloading: http://repo.maven.apache.org/maven2/org/apache/jackrabbit/jackrabbit-jcr-commons/2.6.2/jackrabbit-jcr-commons-2.6.2.jar
Downloading: http://repo.maven.apache.org/maven2/org/apache/jackrabbit/jackrabbit-spi2jcr/2.6.2/jackrabbit-spi2jcr-2.6.2.jar
projectFailed org.onehippo.cms7:hippo-repository-connector:2.25.01-SNAPSHOT
[HUDSON] Archiving <https://builds.onehippo.org/job/hippo-repository%20Trunk/ws/connector/pom.xml> to /var/hudson-data/jobs/hippo-repository Trunk/modules/org.onehippo.cms7$hippo-repository-connector/builds/2013-05-27_11-54-38/archive/org.onehippo.cms7/hippo-repository-connector/2.25.01-SNAPSHOT/pom.xml
sessionEnded
[INFO] ------------------------------------------------------------------------
[INFO] Reactor Summary:
[INFO] 
[INFO] Repository ........................................ SUCCESS [11.160s]
[INFO] Repository API .................................... SUCCESS [9.964s]
[INFO] Repository Utilities .............................. SUCCESS [7.664s]
[INFO] Repository Connector .............................. FAILURE [3.428s]
[INFO] Repository Provider Module Interface .............. SKIPPED
[INFO] Repository Test Utilities ......................... SKIPPED
[INFO] Repository Builtin workflow ....................... SKIPPED
[INFO] Repository Engine ................................. SKIPPED
[INFO] Repository Default Configuration .................. SKIPPED
[INFO] Repository Modules ................................ SKIPPED
[INFO] Repository Deprecated ............................. SKIPPED
[INFO] Repository Deprecated Translation ................. SKIPPED
[INFO] Repository Upgrade Module ......................... SKIPPED
[INFO] Repository Workflow dropbox ....................... SKIPPED
[INFO] Repository workflow implementations ............... SKIPPED
[INFO] Repository Test ................................... SKIPPED
[INFO] Repository Test Content ........................... SKIPPED
[INFO] Repository LDAP based Authorization ............... SKIPPED
[INFO] Repository Resources .............................. SKIPPED
[INFO] Repository Servlets ............................... SKIPPED
[INFO] Repository Dependencies ........................... SKIPPED
[INFO] ------------------------------------------------------------------------
[INFO] BUILD FAILURE
[INFO] ------------------------------------------------------------------------
[INFO] Total time: 39.288s
[INFO] Finished at: Mon May 27 11:55:21 CEST 2013
[INFO] Final Memory: 14M/37M
[INFO] ------------------------------------------------------------------------
maven builder waiting
mavenExecutionResult exceptions not empty
org.apache.maven.lifecycle.LifecycleExecutionException: Failed to execute goal on project hippo-repository-connector: Could not resolve dependencies for project org.onehippo.cms7:hippo-repository-connector:jar:2.25.01-SNAPSHOT: The following artifacts could not be resolved: org.apache.jackrabbit:jackrabbit-api:jar:2.6.2, org.apache.jackrabbit:jackrabbit-jcr-rmi:jar:2.6.2, org.apache.jackrabbit:jackrabbit-jcr-commons:jar:2.6.2, org.apache.jackrabbit:jackrabbit-spi:jar:2.6.2, org.apache.jackrabbit:jackrabbit-jcr2spi:jar:2.6.2, org.apache.jackrabbit:jackrabbit-spi2jcr:jar:2.6.2: Could not find artifact org.apache.jackrabbit:jackrabbit-api:jar:2.6.2 in hippo-maven2-snapshots (http://maven.onehippo.com/maven2-snapshots/)
	at org.apache.maven.lifecycle.internal.LifecycleDependencyResolver.getDependencies(LifecycleDependencyResolver.java:210)
	at org.apache.maven.lifecycle.internal.LifecycleDependencyResolver.resolveProjectDependencies(LifecycleDependencyResolver.java:117)
	at org.apache.maven.lifecycle.internal.MojoExecutor.ensureDependenciesAreResolved(MojoExecutor.java:258)
	at org.apache.maven.lifecycle.internal.MojoExecutor.execute(MojoExecutor.java:201)
	at org.apache.maven.lifecycle.internal.MojoExecutor.execute(MojoExecutor.java:153)
	at org.apache.maven.lifecycle.internal.MojoExecutor.execute(MojoExecutor.java:145)
	at org.apache.maven.lifecycle.internal.LifecycleModuleBuilder.buildProject(LifecycleModuleBuilder.java:84)
	at org.apache.maven.lifecycle.internal.LifecycleModuleBuilder.buildProject(LifecycleModuleBuilder.java:59)
	at org.apache.maven.lifecycle.internal.LifecycleStarter.singleThreadedBuild(LifecycleStarter.java:183)
	at org.apache.maven.lifecycle.internal.LifecycleStarter.execute(LifecycleStarter.java:161)
	at org.apache.maven.DefaultMaven.doExecute(DefaultMaven.java:320)
	at org.apache.maven.DefaultMaven.execute(DefaultMaven.java:156)
	at org.jvnet.hudson.maven3.launcher.Maven3Launcher.main(Maven3Launcher.java:79)
	at sun.reflect.NativeMethodAccessorImpl.invoke0(Native Method)
	at sun.reflect.NativeMethodAccessorImpl.invoke(NativeMethodAccessorImpl.java:39)
	at sun.reflect.DelegatingMethodAccessorImpl.invoke(DelegatingMethodAccessorImpl.java:25)
	at java.lang.reflect.Method.invoke(Method.java:597)
	at org.codehaus.plexus.classworlds.launcher.Launcher.launchStandard(Launcher.java:329)
	at org.codehaus.plexus.classworlds.launcher.Launcher.launch(Launcher.java:239)
	at org.jvnet.hudson.maven3.agent.Maven3Main.launch(Maven3Main.java:146)
	at hudson.maven.Maven3Builder.call(Maven3Builder.java:124)
	at hudson.maven.Maven3Builder.call(Maven3Builder.java:71)
	at hudson.remoting.UserRequest.perform(UserRequest.java:107)
	at hudson.remoting.UserRequest.perform(UserRequest.java:41)
	at hudson.remoting.Request$2.run(Request.java:276)
	at java.util.concurrent.Executors$RunnableAdapter.call(Executors.java:441)
	at java.util.concurrent.FutureTask$Sync.innerRun(FutureTask.java:303)
	at java.util.concurrent.FutureTask.run(FutureTask.java:138)
	at java.util.concurrent.ThreadPoolExecutor$Worker.runTask(ThreadPoolExecutor.java:886)
	at java.util.concurrent.ThreadPoolExecutor$Worker.run(ThreadPoolExecutor.java:908)
	at java.lang.Thread.run(Thread.java:662)
Caused by: org.apache.maven.project.DependencyResolutionException: Could not resolve dependencies for project org.onehippo.cms7:hippo-repository-connector:jar:2.25.01-SNAPSHOT: The following artifacts could not be resolved: org.apache.jackrabbit:jackrabbit-api:jar:2.6.2, org.apache.jackrabbit:jackrabbit-jcr-rmi:jar:2.6.2, org.apache.jackrabbit:jackrabbit-jcr-commons:jar:2.6.2, org.apache.jackrabbit:jackrabbit-spi:jar:2.6.2, org.apache.jackrabbit:jackrabbit-jcr2spi:jar:2.6.2, org.apache.jackrabbit:jackrabbit-spi2jcr:jar:2.6.2: Could not find artifact org.apache.jackrabbit:jackrabbit-api:jar:2.6.2 in hippo-maven2-snapshots (http://maven.onehippo.com/maven2-snapshots/)
	at org.apache.maven.project.DefaultProjectDependenciesResolver.resolve(DefaultProjectDependenciesResolver.java:189)
	at org.apache.maven.lifecycle.internal.LifecycleDependencyResolver.getDependencies(LifecycleDependencyResolver.java:185)
	... 30 more
Caused by: org.sonatype.aether.resolution.DependencyResolutionException: The following artifacts could not be resolved: org.apache.jackrabbit:jackrabbit-api:jar:2.6.2, org.apache.jackrabbit:jackrabbit-jcr-rmi:jar:2.6.2, org.apache.jackrabbit:jackrabbit-jcr-commons:jar:2.6.2, org.apache.jackrabbit:jackrabbit-spi:jar:2.6.2, org.apache.jackrabbit:jackrabbit-jcr2spi:jar:2.6.2, org.apache.jackrabbit:jackrabbit-spi2jcr:jar:2.6.2: Could not find artifact org.apache.jackrabbit:jackrabbit-api:jar:2.6.2 in hippo-maven2-snapshots (http://maven.onehippo.com/maven2-snapshots/)
	at org.sonatype.aether.impl.internal.DefaultRepositorySystem.resolveDependencies(DefaultRepositorySystem.java:375)
	at org.apache.maven.project.DefaultProjectDependenciesResolver.resolve(DefaultProjectDependenciesResolver.java:183)
	... 31 more
Caused by: org.sonatype.aether.resolution.ArtifactResolutionException: The following artifacts could not be resolved: org.apache.jackrabbit:jackrabbit-api:jar:2.6.2, org.apache.jackrabbit:jackrabbit-jcr-rmi:jar:2.6.2, org.apache.jackrabbit:jackrabbit-jcr-commons:jar:2.6.2, org.apache.jackrabbit:jackrabbit-spi:jar:2.6.2, org.apache.jackrabbit:jackrabbit-jcr2spi:jar:2.6.2, org.apache.jackrabbit:jackrabbit-spi2jcr:jar:2.6.2: Could not find artifact org.apache.jackrabbit:jackrabbit-api:jar:2.6.2 in hippo-maven2-snapshots (http://maven.onehippo.com/maven2-snapshots/)
	at org.sonatype.aether.impl.internal.DefaultArtifactResolver.resolve(DefaultArtifactResolver.java:538)
	at org.sonatype.aether.impl.internal.DefaultArtifactResolver.resolveArtifacts(DefaultArtifactResolver.java:216)
	at org.sonatype.aether.impl.internal.DefaultRepositorySystem.resolveDependencies(DefaultRepositorySystem.java:358)
	... 32 more
Caused by: org.sonatype.aether.transfer.ArtifactNotFoundException: Could not find artifact org.apache.jackrabbit:jackrabbit-api:jar:2.6.2 in hippo-maven2-snapshots (http://maven.onehippo.com/maven2-snapshots/)
	at org.sonatype.aether.connector.wagon.WagonRepositoryConnector$4.wrap(WagonRepositoryConnector.java:947)
	at org.sonatype.aether.connector.wagon.WagonRepositoryConnector$4.wrap(WagonRepositoryConnector.java:941)
	at org.sonatype.aether.connector.wagon.WagonRepositoryConnector$GetTask.run(WagonRepositoryConnector.java:669)
	at org.sonatype.aether.util.concurrency.RunnableErrorForwarder$1.run(RunnableErrorForwarder.java:60)
	... 3 more
Sending e-mails to: hippo-cms7-dev at lists.onehippo.org
channel stopped

--
This message is automatically generated by Hudson. 
For more information on Hudson, see: http://hudson-ci.org/


More information about the Hippo-cms7-dev mailing list