[Hippo-cms7-dev] [Hudson] Build failed in Hudson: hippo-cms7-release-7.8.xx #12

Hippo Public Hudson Server beheer at onehippo.com
Wed May 29 13:01:42 CEST 2013


See <https://builds.onehippo.org/job/hippo-cms7-release-7.8.xx/12/changes>

Changes:

[Mathijs den Burger] CMS7-7151: prepare release hippo-cms7-release-7.8.3

[Mathijs den Burger] CMS7-7151: set version back to 7.8.3-SNAPSHOT, set hippo.release to 7.8.3

------------------------------------------
Started by an SCM change
Cleaning up <https://builds.onehippo.org/job/hippo-cms7-release-7.8.xx/ws/.>
Deleting <https://builds.onehippo.org/job/hippo-cms7-release-7.8.xx/ws/target>
Updating http://svn.onehippo.org/repos/hippo/hippo-cms7/release/branches/hippo-cms7-release-7.8.xx revision: May 29, 2013 1:01:22 PM depth:infinity ignoreExternals: false
U         pom.xml
At revision 39485
Found mavenVersion 3.0.4 from file jar:file:/home/hudson/software/maven/apache-maven-3.0-latest/lib/maven-core-3.0.4.jar!/META-INF/maven/org.apache.maven/maven-core/pom.properties
Parsing POMs
[workspace] $ /home/hudson/software/jvm/jdk1.6.0_latest/bin/java -Xmx256m -cp /var/hudson-data/plugins/maven-plugin/WEB-INF/lib/maven3-agent-2.2.2.jar:/home/hudson/software/maven/apache-maven-3.0-latest/boot/plexus-classworlds-2.4.jar org.jvnet.hudson.maven3.agent.Maven3Main /home/hudson/software/maven/apache-maven-3.0-latest /var/hudson-data/war/webapp/WEB-INF/lib/hudson-remoting-3.0.0.jar /var/hudson-data/plugins/maven-plugin/WEB-INF/lib/maven3-interceptor-2.2.2.jar 52889
<===[HUDSON REMOTING CAPACITY]===>   channel started
Executing Maven:  -B -f <https://builds.onehippo.org/job/hippo-cms7-release-7.8.xx/ws/pom.xml> -e -Dsurefire.useFile=false -U clean deploy -Dhippo.snapshots -DskipTests -Ppedantic
[INFO] Error stacktraces are turned on.
[INFO] Scanning for projects...
[INFO]                                                                         
[INFO] ------------------------------------------------------------------------
[INFO] Building Hippo CMS7 Release POM 7.8.3
[INFO] ------------------------------------------------------------------------
[INFO] 
[INFO] --- maven-clean-plugin:2.5:clean (default-clean) @ hippo-cms7-release ---
[INFO] 
[INFO] --- apache-rat-plugin:0.9.RAT125:check (default) @ hippo-cms7-release ---
[INFO] Exclude: **/*.cnd
[INFO] Exclude: **/*.json
[INFO] Exclude: **/*.log
[INFO] Exclude: **/*.patch
[INFO] Exclude: **/*.properties
[INFO] Exclude: **/hippoecm-extension.xml
[INFO] Exclude: **/log4j.dtd
[INFO] Exclude: **/MANIFEST.MF
[INFO] Exclude: **/*.iml
[INFO] 
[INFO] --- maven-remote-resources-plugin:1.4:process (default) @ hippo-cms7-release ---
[INFO] 
[INFO] --- maven-source-plugin:2.2.1:jar-no-fork (attach-sources) @ hippo-cms7-release ---
[INFO] 
[INFO] --- maven-install-plugin:2.3.1:install (default-install) @ hippo-cms7-release ---
[INFO] Installing <https://builds.onehippo.org/job/hippo-cms7-release-7.8.xx/ws/pom.xml> to /var/hudson-data/repository/m2/org/onehippo/cms7/hippo-cms7-release/7.8.3/hippo-cms7-release-7.8.3.pom
[INFO] 
[INFO] --- maven-deploy-plugin:2.7:deploy (default-deploy) @ hippo-cms7-release ---
Uploading: https://maven.onehippo.com/content/repositories/releases/org/onehippo/cms7/hippo-cms7-release/7.8.3/hippo-cms7-release-7.8.3.pom
May 29, 2013 1:01:40 PM org.apache.commons.httpclient.auth.AuthChallengeProcessor selectAuthScheme
INFO: basic authentication scheme selected
mojoFailed org.apache.maven.plugins:maven-deploy-plugin:2.7(default-deploy)
projectFailed org.onehippo.cms7:hippo-cms7-release:7.8.3
[HUDSON] Archiving <https://builds.onehippo.org/job/hippo-cms7-release-7.8.xx/ws/pom.xml> to /var/hudson-data/jobs/hippo-cms7-release-7.8.xx/modules/org.onehippo.cms7$hippo-cms7-release/builds/2013-05-29_13-01-34/archive/org.onehippo.cms7/hippo-cms7-release/7.8.3/pom.xml
sessionEnded
[INFO] ------------------------------------------------------------------------
[INFO] BUILD FAILURE
[INFO] ------------------------------------------------------------------------
[INFO] Total time: 4.340s
[INFO] Finished at: Wed May 29 13:01:41 CEST 2013
[INFO] Final Memory: 11M/26M
[INFO] ------------------------------------------------------------------------
mavenExecutionResult exceptions not empty
org.apache.maven.lifecycle.LifecycleExecutionException: Failed to execute goal org.apache.maven.plugins:maven-deploy-plugin:2.7:deploy (default-deploy) on project hippo-cms7-release: Failed to deploy artifacts: Could not transfer artifact org.onehippo.cms7:hippo-cms7-release:pom:7.8.3 from/to hippo-maven2 (https://maven.onehippo.com/content/repositories/releases/): Failed to transfer file: https://maven.onehippo.com/content/repositories/releases//org/onehippo/cms7/hippo-cms7-release/7.8.3/hippo-cms7-release-7.8.3.pom. Return code is: 400
	at org.apache.maven.lifecycle.internal.MojoExecutor.execute(MojoExecutor.java:217)
	at org.apache.maven.lifecycle.internal.MojoExecutor.execute(MojoExecutor.java:153)
	at org.apache.maven.lifecycle.internal.MojoExecutor.execute(MojoExecutor.java:145)
	at org.apache.maven.lifecycle.internal.LifecycleModuleBuilder.buildProject(LifecycleModuleBuilder.java:84)
	at org.apache.maven.lifecycle.internal.LifecycleModuleBuilder.buildProject(LifecycleModuleBuilder.java:59)
	at org.apache.maven.lifecycle.internal.LifecycleStarter.singleThreadedBuild(LifecycleStarter.java:183)
	at org.apache.maven.lifecycle.internal.LifecycleStarter.execute(LifecycleStarter.java:161)
	at org.apache.maven.DefaultMaven.doExecute(DefaultMaven.java:320)
	at org.apache.maven.DefaultMaven.execute(DefaultMaven.java:156)
	at org.jvnet.hudson.maven3.launcher.Maven3Launcher.main(Maven3Launcher.java:79)
	at sun.reflect.NativeMethodAccessorImpl.invoke0(Native Method)
	at sun.reflect.NativeMethodAccessorImpl.invoke(NativeMethodAccessorImpl.java:39)
	at sun.reflect.DelegatingMethodAccessorImpl.invoke(DelegatingMethodAccessorImpl.java:25)
	at java.lang.reflect.Method.invoke(Method.java:597)
	at org.codehaus.plexus.classworlds.launcher.Launcher.launchStandard(Launcher.java:329)
	at org.codehaus.plexus.classworlds.launcher.Launcher.launch(Launcher.java:239)
	at org.jvnet.hudson.maven3.agent.Maven3Main.launch(Maven3Main.java:146)
	at hudson.maven.Maven3Builder.call(Maven3Builder.java:124)
	at hudson.maven.Maven3Builder.call(Maven3Builder.java:71)
	at hudson.remoting.UserRequest.perform(UserRequest.java:107)
	at hudson.remoting.UserRequest.perform(UserRequest.java:41)
	at hudson.remoting.Request$2.run(Request.java:276)
	at java.util.concurrent.Executors$RunnableAdapter.call(Executors.java:441)
	at java.util.concurrent.FutureTask$Sync.innerRun(FutureTask.java:303)
	at java.util.concurrent.FutureTask.run(FutureTask.java:138)
	at java.util.concurrent.ThreadPoolExecutor$Worker.runTask(ThreadPoolExecutor.java:886)
	at java.util.concurrent.ThreadPoolExecutor$Worker.run(ThreadPoolExecutor.java:908)
	at java.lang.Thread.run(Thread.java:662)
Caused by: org.apache.maven.plugin.MojoExecutionException: Failed to deploy artifacts: Could not transfer artifact org.onehippo.cms7:hippo-cms7-release:pom:7.8.3 from/to hippo-maven2 (https://maven.onehippo.com/content/repositories/releases/): Failed to transfer file: https://maven.onehippo.com/content/repositories/releases//org/onehippo/cms7/hippo-cms7-release/7.8.3/hippo-cms7-release-7.8.3.pom. Return code is: 400
	at org.apache.maven.plugin.deploy.DeployMojo.execute(DeployMojo.java:193)
	at org.apache.maven.plugin.DefaultBuildPluginManager.executeMojo(DefaultBuildPluginManager.java:101)
	at org.apache.maven.lifecycle.internal.MojoExecutor.execute(MojoExecutor.java:209)
	... 27 more
Caused by: org.apache.maven.artifact.deployer.ArtifactDeploymentException: Failed to deploy artifacts: Could not transfer artifact org.onehippo.cms7:hippo-cms7-release:pom:7.8.3 from/to hippo-maven2 (https://maven.onehippo.com/content/repositories/releases/): Failed to transfer file: https://maven.onehippo.com/content/repositories/releases//org/onehippo/cms7/hippo-cms7-release/7.8.3/hippo-cms7-release-7.8.3.pom. Return code is: 400
	at org.apache.maven.artifact.deployer.DefaultArtifactDeployer.deploy(DefaultArtifactDeployer.java:141)
	at org.apache.maven.plugin.deploy.AbstractDeployMojo.deploy(AbstractDeployMojo.java:167)
	at org.apache.maven.plugin.deploy.DeployMojo.execute(DeployMojo.java:149)
	... 29 more
Caused by: org.sonatype.aether.deployment.DeploymentException: Failed to deploy artifacts: Could not transfer artifact org.onehippo.cms7:hippo-cms7-release:pom:7.8.3 from/to hippo-maven2 (https://maven.onehippo.com/content/repositories/releases/): Failed to transfer file: https://maven.onehippo.com/content/repositories/releases//org/onehippo/cms7/hippo-cms7-release/7.8.3/hippo-cms7-release-7.8.3.pom. Return code is: 400
	at org.sonatype.aether.impl.internal.DefaultDeployer.deploy(DefaultDeployer.java:280)
	at org.sonatype.aether.impl.internal.DefaultDeployer.deploy(DefaultDeployer.java:211)
	at org.sonatype.aether.impl.internal.DefaultRepositorySystem.deploy(DefaultRepositorySystem.java:443)
	at org.apache.maven.artifact.deployer.DefaultArtifactDeployer.deploy(DefaultArtifactDeployer.java:137)
	... 31 more
Caused by: org.sonatype.aether.transfer.ArtifactTransferException: Could not transfer artifact org.onehippo.cms7:hippo-cms7-release:pom:7.8.3 from/to hippo-maven2 (https://maven.onehippo.com/content/repositories/releases/): Failed to transfer file: https://maven.onehippo.com/content/repositories/releases//org/onehippo/cms7/hippo-cms7-release/7.8.3/hippo-cms7-release-7.8.3.pom. Return code is: 400
	at org.sonatype.aether.connector.wagon.WagonRepositoryConnector$4.wrap(WagonRepositoryConnector.java:951)
	at org.sonatype.aether.connector.wagon.WagonRepositoryConnector$4.wrap(WagonRepositoryConnector.java:941)
	at org.sonatype.aether.connector.wagon.WagonRepositoryConnector$PutTask.run(WagonRepositoryConnector.java:837)
	at org.sonatype.aether.connector.wagon.WagonRepositoryConnector.put(WagonRepositoryConnector.java:467)
	at org.sonatype.aether.impl.internal.DefaultDeployer.deploy(DefaultDeployer.java:274)
	... 34 more
Caused by: org.apache.maven.wagon.TransferFailedException: Failed to transfer file: https://maven.onehippo.com/content/repositories/releases//org/onehippo/cms7/hippo-cms7-release/7.8.3/hippo-cms7-release-7.8.3.pom. Return code is: 400
	at org.apache.maven.wagon.shared.http.AbstractHttpClientWagon.put(AbstractHttpClientWagon.java:368)
	at org.apache.maven.wagon.shared.http.AbstractHttpClientWagon.put(AbstractHttpClientWagon.java:280)
	at org.sonatype.aether.connector.wagon.WagonRepositoryConnector$PutTask.run(WagonRepositoryConnector.java:811)
	... 36 more
Sending e-mails to: hippo-cms7-dev at lists.onehippo.org
channel stopped
Skipping sonar analysis due to bad build status FAILURE

--
This message is automatically generated by Hudson. 
For more information on Hudson, see: http://hudson-ci.org/


More information about the Hippo-cms7-dev mailing list