[Hippo-cms7-dev] [Hudson] Build failed in Hudson: Repository Integration Trunk #725

Hippo Integration Hudson Server beheer at onehippo.com
Fri Nov 1 10:09:33 CET 2013


See <https://integration.onehippo.com/job/Repository%20Integration%20Trunk/725/changes>

Changes:

[Mathijs den Burger] REPO-655: revert iteration-4 versions to SNAPSHOT

[Unico Hommes] REPO-811 only derivatives referencing modified nodes by the hippo:related property must be updated

[Mathijs den Burger] REPO-811: ignore test, it keeps failing in the nightly build only and blocks subsequent builds that rely on the latest deployed repository changes

[Mathijs den Burger] REPO-811: use a unique repository storage directory for each test so the test won't break on Hudson when a previous directory is present

[aschrijvers] REPO-822 the shortcut for checking isNodeInDomain through parent doc is only allowed for reads

[Unico Hommes] CMS7-7424 While restoring the version the state was copied. This led to the draft becoming an unpublished variant.

[Mathijs den Burger] REPO-823: implemented MockSession#getUserId

It always returns an empty string.

[Mathijs den Burger] REPO-1: let svn ignore .iml files and target directory

------------------------------------------
[...truncated 1642 lines...]
	... 19 more
01.11.2013 10:03:11 ERROR [org.hippoecm.repository.standardworkflow.FolderWorkflowImpl.doArchive():385] error while deleting document variants from attic
javax.jcr.RepositoryException: org.apache.jackrabbit.core.state.StaleItemStateException: f5fcf31f-3057-43a8-8f51-8b264a3d7f94/{http://www.jcp.org/jcr/1.0}isCheckedOut has been modified externally
	at org.apache.jackrabbit.core.version.VersionManagerImplBase.checkoutCheckin(VersionManagerImplBase.java:218)
	at org.apache.jackrabbit.core.VersionManagerImpl.access$400(VersionManagerImpl.java:73)
	at org.apache.jackrabbit.core.VersionManagerImpl$3.perform(VersionManagerImpl.java:161)
	at org.apache.jackrabbit.core.VersionManagerImpl$3.perform(VersionManagerImpl.java:154)
	at org.apache.jackrabbit.core.session.SessionState.perform(SessionState.java:216)
	at org.apache.jackrabbit.core.VersionManagerImpl.perform(VersionManagerImpl.java:96)
	at org.apache.jackrabbit.core.VersionManagerImpl.checkpoint(VersionManagerImpl.java:154)
	at org.hippoecm.repository.impl.VersionManagerDecorator.checkpoint(VersionManagerDecorator.java:75)
	at org.hippoecm.repository.standardworkflow.FolderWorkflowImpl.doArchive(FolderWorkflowImpl.java:375)
	at org.hippoecm.repository.standardworkflow.FolderWorkflowImpl.archive(FolderWorkflowImpl.java:459)
	at sun.reflect.GeneratedMethodAccessor11.invoke(Unknown Source)
	at sun.reflect.DelegatingMethodAccessorImpl.invoke(DelegatingMethodAccessorImpl.java:43)
	at java.lang.reflect.Method.invoke(Method.java:606)
	at org.hippoecm.repository.impl.WorkflowManagerImpl$WorkflowInvocationImpl.invoke(WorkflowManagerImpl.java:870)
	at org.hippoecm.repository.impl.WorkflowManagerImpl$WorkflowInvocationHandler.invoke(WorkflowManagerImpl.java:541)
	at com.sun.proxy.$Proxy21.delete(Unknown Source)
	at org.hippoecm.repository.concurrent.action.DeleteDocumentAction.doExecute(DeleteDocumentAction.java:29)
	at org.hippoecm.repository.concurrent.action.Action.execute(Action.java:44)
	at org.hippoecm.repository.concurrent.AbstractRandomActionTest$RandomActionRunner.step(AbstractRandomActionTest.java:251)
	at org.hippoecm.repository.concurrent.AbstractRandomActionTest$RandomActionRunner.run(AbstractRandomActionTest.java:192)
Caused by: org.apache.jackrabbit.core.state.StaleItemStateException: f5fcf31f-3057-43a8-8f51-8b264a3d7f94/{http://www.jcp.org/jcr/1.0}isCheckedOut has been modified externally
	at org.apache.jackrabbit.core.state.SharedItemStateManager$Update.begin(SharedItemStateManager.java:679)
	at org.apache.jackrabbit.core.state.SharedItemStateManager.beginUpdate(SharedItemStateManager.java:1507)
	at org.apache.jackrabbit.core.state.SharedItemStateManager.update(SharedItemStateManager.java:1537)
	at org.hippoecm.repository.jackrabbit.HippoSharedItemStateManager.update(HippoSharedItemStateManager.java:90)
	at org.apache.jackrabbit.core.state.LocalItemStateManager.update(LocalItemStateManager.java:400)
	at org.apache.jackrabbit.core.state.XAItemStateManager.update(XAItemStateManager.java:354)
	at org.hippoecm.repository.jackrabbit.HippoLocalItemStateManager.update(HippoLocalItemStateManager.java:280)
	at org.apache.jackrabbit.core.state.LocalItemStateManager.update(LocalItemStateManager.java:375)
	at org.hippoecm.repository.jackrabbit.HippoLocalItemStateManager.update(HippoLocalItemStateManager.java:289)
	at org.apache.jackrabbit.core.version.VersionManagerImplBase$WriteOperation.save(VersionManagerImplBase.java:470)
	at org.apache.jackrabbit.core.version.VersionManagerImplBase.checkoutCheckin(VersionManagerImplBase.java:215)
	... 19 more
01.11.2013 10:03:12 ERROR [org.hippoecm.repository.standardworkflow.FolderWorkflowImpl.doArchive():385] error while deleting document variants from attic
javax.jcr.RepositoryException: org.apache.jackrabbit.core.state.StaleItemStateException: 59bacd82-8962-4dac-9d1c-d3f6d6671c4b/{http://www.jcp.org/jcr/1.0}isCheckedOut has been modified externally
	at org.apache.jackrabbit.core.version.VersionManagerImplBase.checkoutCheckin(VersionManagerImplBase.java:218)
	at org.apache.jackrabbit.core.VersionManagerImpl.access$400(VersionManagerImpl.java:73)
	at org.apache.jackrabbit.core.VersionManagerImpl$3.perform(VersionManagerImpl.java:161)
	at org.apache.jackrabbit.core.VersionManagerImpl$3.perform(VersionManagerImpl.java:154)
	at org.apache.jackrabbit.core.session.SessionState.perform(SessionState.java:216)
	at org.apache.jackrabbit.core.VersionManagerImpl.perform(VersionManagerImpl.java:96)
	at org.apache.jackrabbit.core.VersionManagerImpl.checkpoint(VersionManagerImpl.java:154)
	at org.hippoecm.repository.impl.VersionManagerDecorator.checkpoint(VersionManagerDecorator.java:75)
	at org.hippoecm.repository.standardworkflow.FolderWorkflowImpl.doArchive(FolderWorkflowImpl.java:375)
	at org.hippoecm.repository.standardworkflow.FolderWorkflowImpl.archive(FolderWorkflowImpl.java:459)
	at sun.reflect.GeneratedMethodAccessor11.invoke(Unknown Source)
	at sun.reflect.DelegatingMethodAccessorImpl.invoke(DelegatingMethodAccessorImpl.java:43)
	at java.lang.reflect.Method.invoke(Method.java:606)
	at org.hippoecm.repository.impl.WorkflowManagerImpl$WorkflowInvocationImpl.invoke(WorkflowManagerImpl.java:870)
	at org.hippoecm.repository.impl.WorkflowManagerImpl$WorkflowInvocationHandler.invoke(WorkflowManagerImpl.java:541)
	at com.sun.proxy.$Proxy21.delete(Unknown Source)
	at org.hippoecm.repository.concurrent.action.DeleteDocumentAction.doExecute(DeleteDocumentAction.java:29)
	at org.hippoecm.repository.concurrent.action.Action.execute(Action.java:44)
	at org.hippoecm.repository.concurrent.AbstractRandomActionTest$RandomActionRunner.step(AbstractRandomActionTest.java:251)
	at org.hippoecm.repository.concurrent.AbstractRandomActionTest$RandomActionRunner.run(AbstractRandomActionTest.java:192)
Caused by: org.apache.jackrabbit.core.state.StaleItemStateException: 59bacd82-8962-4dac-9d1c-d3f6d6671c4b/{http://www.jcp.org/jcr/1.0}isCheckedOut has been modified externally
	at org.apache.jackrabbit.core.state.SharedItemStateManager$Update.begin(SharedItemStateManager.java:679)
	at org.apache.jackrabbit.core.state.SharedItemStateManager.beginUpdate(SharedItemStateManager.java:1507)
	at org.apache.jackrabbit.core.state.SharedItemStateManager.update(SharedItemStateManager.java:1537)
	at org.hippoecm.repository.jackrabbit.HippoSharedItemStateManager.update(HippoSharedItemStateManager.java:90)
	at org.apache.jackrabbit.core.state.LocalItemStateManager.update(LocalItemStateManager.java:400)
	at org.apache.jackrabbit.core.state.XAItemStateManager.update(XAItemStateManager.java:354)
	at org.hippoecm.repository.jackrabbit.HippoLocalItemStateManager.update(HippoLocalItemStateManager.java:280)
	at org.apache.jackrabbit.core.state.LocalItemStateManager.update(LocalItemStateManager.java:375)
	at org.hippoecm.repository.jackrabbit.HippoLocalItemStateManager.update(HippoLocalItemStateManager.java:289)
	at org.apache.jackrabbit.core.version.VersionManagerImplBase$WriteOperation.save(VersionManagerImplBase.java:470)
	at org.apache.jackrabbit.core.version.VersionManagerImplBase.checkoutCheckin(VersionManagerImplBase.java:215)
	... 19 more
01.11.2013 10:03:22 INFO  [org.hippoecm.repository.concurrent.AbstractRandomActionTest$RandomActionRunner.keepRunning():271] Stopping RandomActionRunner[Thread-12] because of end of test run
01.11.2013 10:03:22 INFO  [org.hippoecm.repository.concurrent.AbstractRandomActionTest$RandomActionRunner.keepRunning():271] Stopping RandomActionRunner[Thread-13] because of end of test run
01.11.2013 10:03:22 INFO  [org.hippoecm.repository.concurrent.AbstractRandomActionTest$RandomActionRunner.keepRunning():271] Stopping RandomActionRunner[Thread-14] because of end of test run
GetDocumentBaseNodeAction executed 251 times; missed 0 failed 0 times; total time spent 12 ms; average time 0
GetAssetBaseNodeAction executed 127 times; missed 0 failed 0 times; total time spent 0 ms; average time 0
GetRandomChildNodeAction executed 597 times; missed 0 failed 0 times; total time spent 124 ms; average time 0
AddDocumentFolderAction executed 41 times; missed 0 failed 0 times; total time spent 1608 ms; average time 39
AddAssetFolderAction executed 59 times; missed 0 failed 0 times; total time spent 2296 ms; average time 38
AddNewsDocumentAction executed 186 times; missed 0 failed 0 times; total time spent 12456 ms; average time 66
PublishAction executed 40 times; missed 1 failed 0 times; total time spent 7088 ms; average time 177
DepublishAction executed 29 times; missed 0 failed 0 times; total time spent 4160 ms; average time 143
DeleteDocumentAction executed 99 times; missed 0 failed 0 times; total time spent 27960 ms; average time 282
LoadDocumentAction executed 327 times; missed 0 failed 0 times; total time spent 216 ms; average time 0
AddDocumentLinkAction executed 120 times; missed 0 failed 0 times; total time spent 10508 ms; average time 87
EditDocumentAction executed 137 times; missed 2 failed 0 times; total time spent 21504 ms; average time 156
AddAssetAction executed 55 times; missed 0 failed 0 times; total time spent 8836 ms; average time 160
DeleteAssetAction executed 36 times; missed 0 failed 0 times; total time spent 1696 ms; average time 47
RenameAssetAction executed 27 times; missed 0 failed 0 times; total time spent 1536 ms; average time 56
DeleteFolderAction executed 43 times; missed 0 failed 0 times; total time spent 972 ms; average time 22
RenameDocumentAction executed 109 times; missed 1 failed 0 times; total time spent 7132 ms; average time 65
MoveDocumentAction executed 95 times; missed 0 failed 0 times; total time spent 7932 ms; average time 83
Total actions run: 2378
Total successful actions: 2374
Total write actions run: 1076
Total missed actions: 4
Total failed actions: 0
Successrate: 1.0
Total time it took: 60.024 sec
Tests run: 1, Failures: 0, Errors: 0, Skipped: 0, Time elapsed: 82.688 sec - in org.hippoecm.repository.concurrent.StampedeTest
Running org.hippoecm.repository.updater.UpdaterTest
Tests run: 3, Failures: 0, Errors: 0, Skipped: 0, Time elapsed: 10.476 sec - in org.hippoecm.repository.updater.UpdaterTest
Running org.hippoecm.repository.sample.SampleRemoteWorkflowTest
Tests run: 2, Failures: 0, Errors: 0, Skipped: 0, Time elapsed: 12.476 sec - in org.hippoecm.repository.sample.SampleRemoteWorkflowTest
Running org.hippoecm.repository.facetnavigation.FacetedNavigationConcurrencyTest
Tests run: 4, Failures: 0, Errors: 0, Skipped: 0, Time elapsed: 60.428 sec - in org.hippoecm.repository.facetnavigation.FacetedNavigationConcurrencyTest
Running org.hippoecm.repository.TotalSizeTest
Tests run: 4, Failures: 0, Errors: 0, Skipped: 0, Time elapsed: 19.916 sec - in org.hippoecm.repository.TotalSizeTest
Running org.hippoecm.repository.test.RemoteTest
Tests run: 1, Failures: 0, Errors: 0, Skipped: 1, Time elapsed: 0.004 sec - in org.hippoecm.repository.test.RemoteTest
Running org.hippoecm.repository.test.WorkflowChainingTest
Tests run: 2, Failures: 0, Errors: 0, Skipped: 0, Time elapsed: 34.652 sec - in org.hippoecm.repository.test.WorkflowChainingTest
Running org.hippoecm.repository.decorating.MirrorTest
Tests run: 4, Failures: 0, Errors: 0, Skipped: 0, Time elapsed: 29.852 sec - in org.hippoecm.repository.decorating.MirrorTest
Running org.hippoecm.repository.quartz.SchedulerTest
01.11.2013 10:06:24 ERROR [org.hippoecm.repository.quartz.JCRJobStore.triggerFired():370] Failed to verify job
org.quartz.JobPersistenceException: No such job: 81438012-5f91-4b62-888b-2a4fc7fbc8d6
	at org.hippoecm.repository.quartz.JCRJobStore.retrieveJob(JCRJobStore.java:173)
	at org.hippoecm.repository.quartz.JCRJobStore.triggerFired(JCRJobStore.java:365)
	at org.quartz.core.QuartzSchedulerThread.run(QuartzSchedulerThread.java:320)
Tests run: 5, Failures: 0, Errors: 2, Skipped: 0, Time elapsed: 169.788 sec <<< FAILURE! - in org.hippoecm.repository.quartz.SchedulerTest
testScheduleAndDeleteRepositoryJob(org.hippoecm.repository.quartz.SchedulerTest)  Time elapsed: 0.04 sec  <<< ERROR!
javax.jcr.RepositoryException: A job with name 'test' already exists in job group 'default'
	at org.hippoecm.repository.quartz.RepositorySchedulerImpl.newJobNode(RepositorySchedulerImpl.java:162)
	at org.hippoecm.repository.quartz.RepositorySchedulerImpl.createQuartzJobDetail(RepositorySchedulerImpl.java:148)
	at org.hippoecm.repository.quartz.RepositorySchedulerImpl.scheduleJob(RepositorySchedulerImpl.java:64)
	at sun.reflect.NativeMethodAccessorImpl.invoke0(Native Method)
	at sun.reflect.NativeMethodAccessorImpl.invoke(NativeMethodAccessorImpl.java:57)
	at sun.reflect.DelegatingMethodAccessorImpl.invoke(DelegatingMethodAccessorImpl.java:43)
	at java.lang.reflect.Method.invoke(Method.java:606)
	at org.onehippo.cms7.services.HippoServiceRegistry$NamedRegistration$1.invoke(HippoServiceRegistry.java:54)
	at com.sun.proxy.$Proxy16.scheduleJob(Unknown Source)
	at org.hippoecm.repository.quartz.SchedulerTest.testScheduleAndDeleteRepositoryJob(SchedulerTest.java:90)

testTriggerRepositoryJobNow(org.hippoecm.repository.quartz.SchedulerTest)  Time elapsed: 0.028 sec  <<< ERROR!
javax.jcr.RepositoryException: A job with name 'test' already exists in job group 'default'
	at org.hippoecm.repository.quartz.RepositorySchedulerImpl.newJobNode(RepositorySchedulerImpl.java:162)
	at org.hippoecm.repository.quartz.RepositorySchedulerImpl.createQuartzJobDetail(RepositorySchedulerImpl.java:148)
	at org.hippoecm.repository.quartz.RepositorySchedulerImpl.scheduleJob(RepositorySchedulerImpl.java:64)
	at sun.reflect.NativeMethodAccessorImpl.invoke0(Native Method)
	at sun.reflect.NativeMethodAccessorImpl.invoke(NativeMethodAccessorImpl.java:57)
	at sun.reflect.DelegatingMethodAccessorImpl.invoke(DelegatingMethodAccessorImpl.java:43)
	at java.lang.reflect.Method.invoke(Method.java:606)
	at org.onehippo.cms7.services.HippoServiceRegistry$NamedRegistration$1.invoke(HippoServiceRegistry.java:54)
	at com.sun.proxy.$Proxy16.scheduleJob(Unknown Source)
	at org.hippoecm.repository.quartz.SchedulerTest.testTriggerRepositoryJobNow(SchedulerTest.java:102)

Running org.onehippo.repository.update.UpdaterExecutorTest
Tests run: 3, Failures: 0, Errors: 0, Skipped: 0, Time elapsed: 24.536 sec - in org.onehippo.repository.update.UpdaterExecutorTest

Results :

Tests in error: 
  SchedulerTest.testScheduleAndDeleteRepositoryJob:90 ? Repository A job with na...
  SchedulerTest.testTriggerRepositoryJobNow:102 ? Repository A job with name 'te...

Tests run: 29, Failures: 0, Errors: 2, Skipped: 1

[WARNING] File encoding has not been set, using platform encoding ANSI_X3.4-1968, i.e. build is platform dependent!
[INFO] 
[INFO] --- maven-failsafe-plugin:2.16:verify (default) @ hippo-repository-test ---
[INFO] Failsafe report directory: <https://integration.onehippo.com/job/Repository%20Integration%20Trunk/ws/test/target/failsafe-reports>
[WARNING] File encoding has not been set, using platform encoding ANSI_X3.4-1968, i.e. build is platform dependent!
[INFO] ------------------------------------------------------------------------
[INFO] Reactor Summary:
[INFO] 
[INFO] Repository ........................................ SUCCESS [3.032s]
[INFO] Repository API .................................... SUCCESS [6.384s]
[INFO] Repository Utilities .............................. SUCCESS [1.916s]
[INFO] Repository Connector .............................. SUCCESS [4.316s]
[INFO] Repository Provider Module Interface .............. SUCCESS [1.820s]
[INFO] Repository Test Utilities ......................... SUCCESS [3.816s]
[INFO] Repository Builtin workflow ....................... SUCCESS [0.992s]
[INFO] Repository Engine ................................. SUCCESS [2:11.060s]
[INFO] Repository Default Configuration .................. SUCCESS [22.832s]
[INFO] Repository Modules ................................ SUCCESS [26.588s]
[INFO] Repository Test Content ........................... SUCCESS [0.252s]
[INFO] Repository Deprecated ............................. SUCCESS [0.072s]
[INFO] Repository Deprecated Facetselect Mirror .......... SUCCESS [22.752s]
[INFO] Repository workflow implementations ............... SUCCESS [8:12.208s]
[INFO] Repository Deprecated Translation ................. SUCCESS [20.640s]
[INFO] Repository Deprecated Facetsearch ................. SUCCESS [30.880s]
[INFO] Repository Upgrade Module ......................... SUCCESS [11.828s]
[INFO] Repository Upgrade ................................ SUCCESS [0.076s]
[INFO] Repository Handle Migration ....................... SUCCESS [39.848s]
[INFO] Repository Upgrade XML Bootstrap Migration ........ SUCCESS [4.100s]
[INFO] Repository Test ................................... FAILURE [9:35.636s]
[INFO] Repository LDAP based Authorization ............... SKIPPED
[INFO] Repository Resources .............................. SKIPPED
[INFO] Repository Servlets ............................... SKIPPED
[INFO] Repository Dependencies ........................... SKIPPED
[INFO] ------------------------------------------------------------------------
[INFO] BUILD FAILURE
[INFO] ------------------------------------------------------------------------
[INFO] Total time: 23:25.396s
[INFO] Finished at: Fri Nov 01 10:09:29 CET 2013
[INFO] Final Memory: 22M/170M
[INFO] ------------------------------------------------------------------------
[INFO] o.h.m.e.h.MavenExecutionResultHandler - Build failed with exception(s)
[INFO] o.h.m.e.h.MavenExecutionResultHandler - [1] org.apache.maven.lifecycle.LifecycleExecutionException: Failed to execute goal org.apache.maven.plugins:maven-failsafe-plugin:2.16:verify (default) on project hippo-repository-test: There are test failures.

Please refer to <https://integration.onehippo.com/job/Repository%20Integration%20Trunk/ws/test/target/failsafe-reports> for the individual test results.
[DEBUG] Closing connection to remote
[ERROR] Failed to execute goal org.apache.maven.plugins:maven-failsafe-plugin:2.16:verify (default) on project hippo-repository-test: There are test failures.
[ERROR] 
[ERROR] Please refer to <https://integration.onehippo.com/job/Repository%20Integration%20Trunk/ws/test/target/failsafe-reports> for the individual test results.
[ERROR] -> [Help 1]
org.apache.maven.lifecycle.LifecycleExecutionException: Failed to execute goal org.apache.maven.plugins:maven-failsafe-plugin:2.16:verify (default) on project hippo-repository-test: There are test failures.

Please refer to <https://integration.onehippo.com/job/Repository%20Integration%20Trunk/ws/test/target/failsafe-reports> for the individual test results.
	at org.apache.maven.lifecycle.internal.MojoExecutor.execute(MojoExecutor.java:213)
	at org.apache.maven.lifecycle.internal.MojoExecutor.execute(MojoExecutor.java:153)
	at org.apache.maven.lifecycle.internal.MojoExecutor.execute(MojoExecutor.java:145)
	at org.apache.maven.lifecycle.internal.LifecycleModuleBuilder.buildProject(LifecycleModuleBuilder.java:84)
	at org.apache.maven.lifecycle.internal.LifecycleModuleBuilder.buildProject(LifecycleModuleBuilder.java:59)
	at org.apache.maven.lifecycle.internal.LifecycleStarter.singleThreadedBuild(LifecycleStarter.java:183)
	at org.apache.maven.lifecycle.internal.LifecycleStarter.execute(LifecycleStarter.java:161)
	at org.apache.maven.DefaultMaven.doExecute(DefaultMaven.java:319)
	at org.apache.maven.DefaultMaven.execute(DefaultMaven.java:156)
	at org.apache.maven.cli.MavenCli.execute(MavenCli.java:537)
	at org.apache.maven.cli.MavenCli.doMain(MavenCli.java:196)
	at org.apache.maven.cli.MavenCli.main(MavenCli.java:141)
	at sun.reflect.NativeMethodAccessorImpl.invoke0(Native Method)
	at sun.reflect.NativeMethodAccessorImpl.invoke(NativeMethodAccessorImpl.java:57)
	at sun.reflect.DelegatingMethodAccessorImpl.invoke(DelegatingMethodAccessorImpl.java:43)
	at java.lang.reflect.Method.invoke(Method.java:606)
	at org.codehaus.plexus.classworlds.launcher.Launcher.launchEnhanced(Launcher.java:290)
	at org.codehaus.plexus.classworlds.launcher.Launcher.launch(Launcher.java:230)
	at org.codehaus.plexus.classworlds.launcher.Launcher.mainWithExitCode(Launcher.java:409)
	at org.codehaus.plexus.classworlds.launcher.Launcher.main(Launcher.java:352)
Caused by: org.apache.maven.plugin.MojoFailureException: There are test failures.

Please refer to <https://integration.onehippo.com/job/Repository%20Integration%20Trunk/ws/test/target/failsafe-reports> for the individual test results.
	at org.apache.maven.plugin.surefire.SurefireHelper.reportExecution(SurefireHelper.java:82)
	at org.apache.maven.plugin.failsafe.VerifyMojo.execute(VerifyMojo.java:194)
	at org.apache.maven.plugin.DefaultBuildPluginManager.executeMojo(DefaultBuildPluginManager.java:101)
	at org.apache.maven.lifecycle.internal.MojoExecutor.execute(MojoExecutor.java:209)
	... 19 more
[ERROR] 
[ERROR] Re-run Maven using the -X switch to enable full debug logging.
[ERROR] 
[ERROR] For more information about the errors and possible solutions, please read the following articles:
[ERROR] [Help 1] http://cwiki.apache.org/confluence/display/MAVEN/MojoFailureException
[ERROR] 
[ERROR] After correcting the problems, you can resume the build with the command
[ERROR]   mvn <goals> -rf :hippo-repository-test
[DEBUG] Waiting for process to finish
[DEBUG] Result: 1
Recording test results

--
This message is automatically generated by Hudson. 
For more information on Hudson, see: http://hudson-ci.org/


More information about the Hippo-cms7-dev mailing list