[Hippo-cms7-dev] [Hudson] Build failed in Hudson: testsuite-1.04.xx #13

Hippo Public Hudson Server beheer at onehippo.com
Tue Nov 5 10:07:29 CET 2013


See <https://builds.onehippo.org/job/testsuite-1.04.xx/13/>

------------------------------------------
Started by user bvdschans
Cleaning workspace <https://builds.onehippo.org/job/testsuite-1.04.xx/ws/>
Checking out http://svn.onehippo.org/repos/hippo/hippo-cms7/testsuite/branches/hippo-testsuite-1.04.xx revision: Nov 5, 2013 10:07:18 AM depth:infinity ignoreExternals: false
ERROR: Failed to check out http://svn.onehippo.org/repos/hippo/hippo-cms7/testsuite/branches/hippo-testsuite-1.04.xx
org.tmatesoft.svn.core.SVNException: svn: E200030: BUSY
	at org.tmatesoft.svn.core.internal.wc.SVNErrorManager.error(SVNErrorManager.java:64)
	at org.tmatesoft.svn.core.internal.wc.SVNErrorManager.error(SVNErrorManager.java:51)
	at org.tmatesoft.svn.core.internal.db.SVNSqlJetDb.createSqlJetError(SVNSqlJetDb.java:174)
	at org.tmatesoft.svn.core.internal.wc17.db.statement.SVNWCDbCreateSchema.exec(SVNWCDbCreateSchema.java:278)
	at org.tmatesoft.svn.core.internal.db.SVNSqlJetDb.execStatement(SVNSqlJetDb.java:168)
	at org.tmatesoft.svn.core.internal.wc17.db.SVNWCDb.createDb(SVNWCDb.java:255)
	at org.tmatesoft.svn.core.internal.wc17.db.SVNWCDb.init(SVNWCDb.java:206)
	at org.tmatesoft.svn.core.internal.wc17.SVNWCContext.initWC(SVNWCContext.java:4270)
	at org.tmatesoft.svn.core.internal.wc17.SVNWCContext.initializeWC(SVNWCContext.java:4219)
	at org.tmatesoft.svn.core.internal.wc2.ng.SvnNgAbstractUpdate.checkout(SvnNgAbstractUpdate.java:746)
	at org.tmatesoft.svn.core.internal.wc2.ng.SvnNgCheckout.run(SvnNgCheckout.java:14)
	at org.tmatesoft.svn.core.internal.wc2.ng.SvnNgCheckout.run(SvnNgCheckout.java:9)
	at org.tmatesoft.svn.core.internal.wc2.ng.SvnNgOperationRunner.run(SvnNgOperationRunner.java:20)
	at org.tmatesoft.svn.core.internal.wc2.SvnOperationRunner.run(SvnOperationRunner.java:20)
	at org.tmatesoft.svn.core.wc2.SvnOperationFactory.run(SvnOperationFactory.java:1235)
	at org.tmatesoft.svn.core.wc2.SvnOperation.run(SvnOperation.java:291)
	at org.tmatesoft.svn.core.wc.SVNUpdateClient.doCheckout(SVNUpdateClient.java:777)
	at hudson.scm.subversion.CheckoutUpdater$UpdateTaskImpl.perform(CheckoutUpdater.java:111)
	at hudson.scm.subversion.WorkspaceUpdater$UpdateTask.delegateTo(WorkspaceUpdater.java:152)
	at hudson.scm.SubversionSCM$CheckOutTask.perform(SubversionSCM.java:812)
	at hudson.scm.SubversionSCM$CheckOutTask.invoke(SubversionSCM.java:795)
	at hudson.scm.SubversionSCM$CheckOutTask.invoke(SubversionSCM.java:776)
	at hudson.FilePath.act(FilePath.java:793)
	at hudson.FilePath.act(FilePath.java:775)
	at hudson.scm.SubversionSCM.checkout(SubversionSCM.java:768)
	at hudson.scm.SubversionSCM.checkout(SubversionSCM.java:711)
	at hudson.model.AbstractProject.checkout(AbstractProject.java:1523)
	at hudson.model.AbstractBuild$AbstractRunner.checkout(AbstractBuild.java:610)
	at hudson.model.AbstractBuild$AbstractRunner.run(AbstractBuild.java:517)
	at hudson.model.Run.run(Run.java:1434)
	at hudson.maven.MavenModuleSetBuild.run(MavenModuleSetBuild.java:420)
	at hudson.model.ResourceController.execute(ResourceController.java:82)
	at hudson.model.Executor.run(Executor.java:137)
Caused by: org.tmatesoft.sqljet.core.SqlJetException: BUSY: error code is BUSY
	at org.tmatesoft.sqljet.core.internal.pager.SqlJetPager.begin(SqlJetPager.java:2785)
	at org.tmatesoft.sqljet.core.internal.btree.SqlJetBtree.beginTrans(SqlJetBtree.java:929)
	at org.tmatesoft.sqljet.core.table.engine.SqlJetEngine.doBeginTransaction(SqlJetEngine.java:561)
	at org.tmatesoft.sqljet.core.table.engine.SqlJetEngine.access$100(SqlJetEngine.java:55)
	at org.tmatesoft.sqljet.core.table.engine.SqlJetEngine$12.runSynchronized(SqlJetEngine.java:535)
	at org.tmatesoft.sqljet.core.table.engine.SqlJetEngine.runSynchronized(SqlJetEngine.java:217)
	at org.tmatesoft.sqljet.core.table.engine.SqlJetEngine.runEngineTransaction(SqlJetEngine.java:529)
	at org.tmatesoft.sqljet.core.table.SqlJetDb.runTransaction(SqlJetDb.java:238)
	at org.tmatesoft.sqljet.core.table.SqlJetDb.runWriteTransaction(SqlJetDb.java:211)
	at org.tmatesoft.svn.core.internal.wc17.db.statement.SVNWCDbCreateSchema.exec(SVNWCDbCreateSchema.java:206)
	... 29 more

--
This message is automatically generated by Hudson. 
For more information on Hudson, see: http://hudson-ci.org/


More information about the Hippo-cms7-dev mailing list