[Hippo-cms7-dev] [Hudson] Build failed in Hudson: Repository Integration Trunk #730

Hippo Integration Hudson Server beheer at onehippo.com
Tue Nov 5 10:09:31 CET 2013


See <https://integration.onehippo.com/job/Repository%20Integration%20Trunk/730/changes>

Changes:

[Unico Hommes] REPO-827 code re-use; after removing the versionable mixin the node must be checked out again because of checked out status inheritence

[aschrijvers] REPO-1 unneeded cast

[aschrijvers] REPO-1 remove dead code

[Unico Hommes] REPO-827 revert accidental commit

[Unico Hommes] REPO-827 add document migrator

[Unico Hommes] REPO-827 add document migrator

[aschrijvers] REPO-825 correct typo

[Frank van Lankvelt] REPO-1: remove unneeded cleanup code; the /test node is cleaned up by the base class

[Unico Hommes] REPO-774 formatting and typos

[aschrijvers] REPO-826 performance impr: In case for read access check, use cache

[aschrijvers] REPO-822 revert the part about performance impr as should go in separate issue

[aschrijvers] REPO-825 add facetnavigation node types to default read

[aschrijvers] REPO-775 enable test

------------------------------------------
[...truncated 2204 lines...]
Path: /content/documents/default/document8/document8
Stacktrace
java.lang.AssertionError
	at org.apache.jackrabbit.core.ItemSaveOperation.removeTransientItems(ItemSaveOperation.java:721)
	at org.apache.jackrabbit.core.ItemSaveOperation.perform(ItemSaveOperation.java:228)
	at org.apache.jackrabbit.core.session.SessionState.perform(SessionState.java:216)
	at org.apache.jackrabbit.core.ItemImpl.perform(ItemImpl.java:91)
	at org.apache.jackrabbit.core.ItemImpl.save(ItemImpl.java:329)
	at org.apache.jackrabbit.core.session.SessionSaveOperation.perform(SessionSaveOperation.java:65)
	at org.apache.jackrabbit.core.session.SessionState.perform(SessionState.java:216)
	at org.apache.jackrabbit.core.SessionImpl.perform(SessionImpl.java:365)
	at org.apache.jackrabbit.core.SessionImpl.save(SessionImpl.java:816)
	at org.hippoecm.repository.decorating.SessionDecorator.save(SessionDecorator.java:192)
	at org.hippoecm.repository.impl.SessionDecorator.save(SessionDecorator.java:171)
	at org.hippoecm.repository.impl.WorkflowManagerImpl$WorkflowInvocationHandler.invoke(WorkflowManagerImpl.java:526)
	at com.sun.proxy.$Proxy20.delete(Unknown Source)
	at org.hippoecm.repository.concurrent.action.DeleteDocumentAction.doExecute(DeleteDocumentAction.java:29)
	at org.hippoecm.repository.concurrent.action.Action.execute(Action.java:44)
	at org.hippoecm.repository.concurrent.AbstractRandomActionTest$RandomActionRunner.step(AbstractRandomActionTest.java:251)
	at org.hippoecm.repository.concurrent.AbstractRandomActionTest$RandomActionRunner.run(AbstractRandomActionTest.java:192)
Action: org.hippoecm.repository.concurrent.action.DeleteDocumentAction at 12e86ee
Path: /content/documents/default/document8/document8
Stacktrace
java.lang.AssertionError
	at org.apache.jackrabbit.core.ItemSaveOperation.removeTransientItems(ItemSaveOperation.java:721)
	at org.apache.jackrabbit.core.ItemSaveOperation.perform(ItemSaveOperation.java:228)
	at org.apache.jackrabbit.core.session.SessionState.perform(SessionState.java:216)
	at org.apache.jackrabbit.core.ItemImpl.perform(ItemImpl.java:91)
	at org.apache.jackrabbit.core.ItemImpl.save(ItemImpl.java:329)
	at org.apache.jackrabbit.core.session.SessionSaveOperation.perform(SessionSaveOperation.java:65)
	at org.apache.jackrabbit.core.session.SessionState.perform(SessionState.java:216)
	at org.apache.jackrabbit.core.SessionImpl.perform(SessionImpl.java:365)
	at org.apache.jackrabbit.core.SessionImpl.save(SessionImpl.java:816)
	at org.hippoecm.repository.decorating.SessionDecorator.save(SessionDecorator.java:192)
	at org.hippoecm.repository.impl.SessionDecorator.save(SessionDecorator.java:171)
	at org.hippoecm.repository.impl.WorkflowManagerImpl$WorkflowInvocationHandler.invoke(WorkflowManagerImpl.java:526)
	at com.sun.proxy.$Proxy20.delete(Unknown Source)
	at org.hippoecm.repository.concurrent.action.DeleteDocumentAction.doExecute(DeleteDocumentAction.java:29)
	at org.hippoecm.repository.concurrent.action.Action.execute(Action.java:44)
	at org.hippoecm.repository.concurrent.AbstractRandomActionTest$RandomActionRunner.step(AbstractRandomActionTest.java:251)
	at org.hippoecm.repository.concurrent.AbstractRandomActionTest$RandomActionRunner.run(AbstractRandomActionTest.java:192)
Action: org.hippoecm.repository.concurrent.action.DeleteDocumentAction at 12e86ee
Path: /content/documents/default/document8/document8
Stacktrace
java.lang.AssertionError
	at org.apache.jackrabbit.core.ItemSaveOperation.removeTransientItems(ItemSaveOperation.java:721)
	at org.apache.jackrabbit.core.ItemSaveOperation.perform(ItemSaveOperation.java:228)
	at org.apache.jackrabbit.core.session.SessionState.perform(SessionState.java:216)
	at org.apache.jackrabbit.core.ItemImpl.perform(ItemImpl.java:91)
	at org.apache.jackrabbit.core.ItemImpl.save(ItemImpl.java:329)
	at org.apache.jackrabbit.core.session.SessionSaveOperation.perform(SessionSaveOperation.java:65)
	at org.apache.jackrabbit.core.session.SessionState.perform(SessionState.java:216)
	at org.apache.jackrabbit.core.SessionImpl.perform(SessionImpl.java:365)
	at org.apache.jackrabbit.core.SessionImpl.save(SessionImpl.java:816)
	at org.hippoecm.repository.decorating.SessionDecorator.save(SessionDecorator.java:192)
	at org.hippoecm.repository.impl.SessionDecorator.save(SessionDecorator.java:171)
	at org.hippoecm.repository.impl.WorkflowManagerImpl$WorkflowInvocationHandler.invoke(WorkflowManagerImpl.java:526)
	at com.sun.proxy.$Proxy20.delete(Unknown Source)
	at org.hippoecm.repository.concurrent.action.DeleteDocumentAction.doExecute(DeleteDocumentAction.java:29)
	at org.hippoecm.repository.concurrent.action.Action.execute(Action.java:44)
	at org.hippoecm.repository.concurrent.AbstractRandomActionTest$RandomActionRunner.step(AbstractRandomActionTest.java:251)
	at org.hippoecm.repository.concurrent.AbstractRandomActionTest$RandomActionRunner.run(AbstractRandomActionTest.java:192)
Action: org.hippoecm.repository.concurrent.action.DeleteDocumentAction at 12e86ee
Path: /content/documents/default/document8/document8
Stacktrace
java.lang.AssertionError
	at org.apache.jackrabbit.core.ItemSaveOperation.removeTransientItems(ItemSaveOperation.java:721)
	at org.apache.jackrabbit.core.ItemSaveOperation.perform(ItemSaveOperation.java:228)
	at org.apache.jackrabbit.core.session.SessionState.perform(SessionState.java:216)
	at org.apache.jackrabbit.core.ItemImpl.perform(ItemImpl.java:91)
	at org.apache.jackrabbit.core.ItemImpl.save(ItemImpl.java:329)
	at org.apache.jackrabbit.core.session.SessionSaveOperation.perform(SessionSaveOperation.java:65)
	at org.apache.jackrabbit.core.session.SessionState.perform(SessionState.java:216)
	at org.apache.jackrabbit.core.SessionImpl.perform(SessionImpl.java:365)
	at org.apache.jackrabbit.core.SessionImpl.save(SessionImpl.java:816)
	at org.hippoecm.repository.decorating.SessionDecorator.save(SessionDecorator.java:192)
	at org.hippoecm.repository.impl.SessionDecorator.save(SessionDecorator.java:171)
	at org.hippoecm.repository.impl.WorkflowManagerImpl$WorkflowInvocationHandler.invoke(WorkflowManagerImpl.java:526)
	at com.sun.proxy.$Proxy20.delete(Unknown Source)
	at org.hippoecm.repository.concurrent.action.DeleteDocumentAction.doExecute(DeleteDocumentAction.java:29)
	at org.hippoecm.repository.concurrent.action.Action.execute(Action.java:44)
	at org.hippoecm.repository.concurrent.AbstractRandomActionTest$RandomActionRunner.step(AbstractRandomActionTest.java:251)
	at org.hippoecm.repository.concurrent.AbstractRandomActionTest$RandomActionRunner.run(AbstractRandomActionTest.java:192)
Action: org.hippoecm.repository.concurrent.action.DeleteDocumentAction at 12e86ee
Path: /content/documents/default/document8/document8
Stacktrace
java.lang.AssertionError
	at org.apache.jackrabbit.core.ItemSaveOperation.removeTransientItems(ItemSaveOperation.java:721)
	at org.apache.jackrabbit.core.ItemSaveOperation.perform(ItemSaveOperation.java:228)
	at org.apache.jackrabbit.core.session.SessionState.perform(SessionState.java:216)
	at org.apache.jackrabbit.core.ItemImpl.perform(ItemImpl.java:91)
	at org.apache.jackrabbit.core.ItemImpl.save(ItemImpl.java:329)
	at org.apache.jackrabbit.core.session.SessionSaveOperation.perform(SessionSaveOperation.java:65)
	at org.apache.jackrabbit.core.session.SessionState.perform(SessionState.java:216)
	at org.apache.jackrabbit.core.SessionImpl.perform(SessionImpl.java:365)
	at org.apache.jackrabbit.core.SessionImpl.save(SessionImpl.java:816)
	at org.hippoecm.repository.decorating.SessionDecorator.save(SessionDecorator.java:192)
	at org.hippoecm.repository.impl.SessionDecorator.save(SessionDecorator.java:171)
	at org.hippoecm.repository.impl.WorkflowManagerImpl$WorkflowInvocationHandler.invoke(WorkflowManagerImpl.java:526)
	at com.sun.proxy.$Proxy20.delete(Unknown Source)
	at org.hippoecm.repository.concurrent.action.DeleteDocumentAction.doExecute(DeleteDocumentAction.java:29)
	at org.hippoecm.repository.concurrent.action.Action.execute(Action.java:44)
	at org.hippoecm.repository.concurrent.AbstractRandomActionTest$RandomActionRunner.step(AbstractRandomActionTest.java:251)
	at org.hippoecm.repository.concurrent.AbstractRandomActionTest$RandomActionRunner.run(AbstractRandomActionTest.java:192)
Action: org.hippoecm.repository.concurrent.action.DeleteDocumentAction at 12e86ee
Path: /content/documents/default/document8/document8
Stacktrace
java.lang.AssertionError
	at org.apache.jackrabbit.core.ItemSaveOperation.removeTransientItems(ItemSaveOperation.java:721)
	at org.apache.jackrabbit.core.ItemSaveOperation.perform(ItemSaveOperation.java:228)
	at org.apache.jackrabbit.core.session.SessionState.perform(SessionState.java:216)
	at org.apache.jackrabbit.core.ItemImpl.perform(ItemImpl.java:91)
	at org.apache.jackrabbit.core.ItemImpl.save(ItemImpl.java:329)
	at org.apache.jackrabbit.core.session.SessionSaveOperation.perform(SessionSaveOperation.java:65)
	at org.apache.jackrabbit.core.session.SessionState.perform(SessionState.java:216)
	at org.apache.jackrabbit.core.SessionImpl.perform(SessionImpl.java:365)
	at org.apache.jackrabbit.core.SessionImpl.save(SessionImpl.java:816)
	at org.hippoecm.repository.decorating.SessionDecorator.save(SessionDecorator.java:192)
	at org.hippoecm.repository.impl.SessionDecorator.save(SessionDecorator.java:171)
	at org.hippoecm.repository.impl.WorkflowManagerImpl$WorkflowInvocationHandler.invoke(WorkflowManagerImpl.java:526)
	at com.sun.proxy.$Proxy20.delete(Unknown Source)
	at org.hippoecm.repository.concurrent.action.DeleteDocumentAction.doExecute(DeleteDocumentAction.java:29)
	at org.hippoecm.repository.concurrent.action.Action.execute(Action.java:44)
	at org.hippoecm.repository.concurrent.AbstractRandomActionTest$RandomActionRunner.step(AbstractRandomActionTest.java:251)
	at org.hippoecm.repository.concurrent.AbstractRandomActionTest$RandomActionRunner.run(AbstractRandomActionTest.java:192)
Tests run: 2, Failures: 1, Errors: 0, Skipped: 0, Time elapsed: 82.304 sec <<< FAILURE! - in org.hippoecm.repository.concurrent.StampedeTest
stampede[0](org.hippoecm.repository.concurrent.StampedeTest)  Time elapsed: 78.732 sec  <<< FAILURE!
java.lang.AssertionError: 
	at org.junit.Assert.fail(Assert.java:74)
	at org.junit.Assert.fail(Assert.java:81)
	at org.hippoecm.repository.concurrent.StampedeTest.stampede(StampedeTest.java:133)

Running org.hippoecm.repository.updater.UpdaterTest
Tests run: 3, Failures: 0, Errors: 0, Skipped: 0, Time elapsed: 10.424 sec - in org.hippoecm.repository.updater.UpdaterTest
Running org.hippoecm.repository.sample.SampleRemoteWorkflowTest
Tests run: 2, Failures: 0, Errors: 0, Skipped: 0, Time elapsed: 12.928 sec - in org.hippoecm.repository.sample.SampleRemoteWorkflowTest
Running org.hippoecm.repository.facetnavigation.FacetedNavigationConcurrencyTest
Tests run: 4, Failures: 0, Errors: 0, Skipped: 0, Time elapsed: 65.068 sec - in org.hippoecm.repository.facetnavigation.FacetedNavigationConcurrencyTest
Running org.hippoecm.repository.TotalSizeTest
Tests run: 4, Failures: 0, Errors: 0, Skipped: 0, Time elapsed: 20.032 sec - in org.hippoecm.repository.TotalSizeTest
Running org.hippoecm.repository.test.RemoteTest
Tests run: 1, Failures: 0, Errors: 0, Skipped: 1, Time elapsed: 0 sec - in org.hippoecm.repository.test.RemoteTest
Running org.hippoecm.repository.test.WorkflowChainingTest
Tests run: 2, Failures: 0, Errors: 0, Skipped: 0, Time elapsed: 34.808 sec - in org.hippoecm.repository.test.WorkflowChainingTest
Running org.hippoecm.repository.decorating.MirrorTest
Tests run: 4, Failures: 0, Errors: 0, Skipped: 0, Time elapsed: 29.872 sec - in org.hippoecm.repository.decorating.MirrorTest
Running org.hippoecm.repository.quartz.SchedulerTest
Tests run: 5, Failures: 0, Errors: 0, Skipped: 0, Time elapsed: 149.72 sec - in org.hippoecm.repository.quartz.SchedulerTest
Running org.onehippo.repository.update.UpdaterExecutorTest
Tests run: 3, Failures: 0, Errors: 0, Skipped: 0, Time elapsed: 24.52 sec - in org.onehippo.repository.update.UpdaterExecutorTest

Results :

Failed tests: 
  StampedeTest.stampede:133 

Tests run: 30, Failures: 1, Errors: 0, Skipped: 1

[WARNING] File encoding has not been set, using platform encoding ANSI_X3.4-1968, i.e. build is platform dependent!
[INFO] 
[INFO] --- maven-failsafe-plugin:2.16:verify (default) @ hippo-repository-test ---
[INFO] Failsafe report directory: <https://integration.onehippo.com/job/Repository%20Integration%20Trunk/ws/test/target/failsafe-reports>
[WARNING] File encoding has not been set, using platform encoding ANSI_X3.4-1968, i.e. build is platform dependent!
[INFO] ------------------------------------------------------------------------
[INFO] Reactor Summary:
[INFO] 
[INFO] Repository ........................................ SUCCESS [2.960s]
[INFO] Repository API .................................... SUCCESS [5.816s]
[INFO] Repository Utilities .............................. SUCCESS [1.900s]
[INFO] Repository Connector .............................. SUCCESS [4.308s]
[INFO] Repository Provider Module Interface .............. SUCCESS [1.908s]
[INFO] Repository Test Utilities ......................... SUCCESS [3.436s]
[INFO] Repository Builtin workflow ....................... SUCCESS [1.040s]
[INFO] Repository Engine ................................. SUCCESS [2:13.080s]
[INFO] Repository Default Configuration .................. SUCCESS [20.912s]
[INFO] Repository Modules ................................ SUCCESS [26.936s]
[INFO] Repository Test Content ........................... SUCCESS [0.196s]
[INFO] Repository Deprecated ............................. SUCCESS [0.068s]
[INFO] Repository Deprecated Facetselect Mirror .......... SUCCESS [23.252s]
[INFO] Repository workflow implementations ............... SUCCESS [8:14.956s]
[INFO] Repository Deprecated Translation ................. SUCCESS [20.708s]
[INFO] Repository Deprecated Facetsearch ................. SUCCESS [31.108s]
[INFO] Repository Upgrade Module ......................... SUCCESS [11.892s]
[INFO] Repository Upgrade ................................ SUCCESS [0.076s]
[INFO] Repository Handle Migration ....................... SUCCESS [46.360s]
[INFO] Repository Upgrade XML Bootstrap Migration ........ SUCCESS [3.844s]
[INFO] Repository Test ................................... FAILURE [9:25.380s]
[INFO] Repository LDAP based Authorization ............... SKIPPED
[INFO] Repository Resources .............................. SKIPPED
[INFO] Repository Servlets ............................... SKIPPED
[INFO] Repository Dependencies ........................... SKIPPED
[INFO] ------------------------------------------------------------------------
[INFO] BUILD FAILURE
[INFO] ------------------------------------------------------------------------
[INFO] Total time: 23:24.048s
[INFO] Finished at: Tue Nov 05 10:09:29 CET 2013
[INFO] Final Memory: 22M/171M
[INFO] ------------------------------------------------------------------------
[INFO] o.h.m.e.h.MavenExecutionResultHandler - Build failed with exception(s)
[INFO] o.h.m.e.h.MavenExecutionResultHandler - [1] org.apache.maven.lifecycle.LifecycleExecutionException: Failed to execute goal org.apache.maven.plugins:maven-failsafe-plugin:2.16:verify (default) on project hippo-repository-test: There are test failures.

Please refer to <https://integration.onehippo.com/job/Repository%20Integration%20Trunk/ws/test/target/failsafe-reports> for the individual test results.
[DEBUG] Closing connection to remote
[ERROR] Failed to execute goal org.apache.maven.plugins:maven-failsafe-plugin:2.16:verify (default) on project hippo-repository-test: There are test failures.
[ERROR] 
[ERROR] Please refer to <https://integration.onehippo.com/job/Repository%20Integration%20Trunk/ws/test/target/failsafe-reports> for the individual test results.
[ERROR] -> [Help 1]
org.apache.maven.lifecycle.LifecycleExecutionException: Failed to execute goal org.apache.maven.plugins:maven-failsafe-plugin:2.16:verify (default) on project hippo-repository-test: There are test failures.

Please refer to <https://integration.onehippo.com/job/Repository%20Integration%20Trunk/ws/test/target/failsafe-reports> for the individual test results.
	at org.apache.maven.lifecycle.internal.MojoExecutor.execute(MojoExecutor.java:213)
	at org.apache.maven.lifecycle.internal.MojoExecutor.execute(MojoExecutor.java:153)
	at org.apache.maven.lifecycle.internal.MojoExecutor.execute(MojoExecutor.java:145)
	at org.apache.maven.lifecycle.internal.LifecycleModuleBuilder.buildProject(LifecycleModuleBuilder.java:84)
	at org.apache.maven.lifecycle.internal.LifecycleModuleBuilder.buildProject(LifecycleModuleBuilder.java:59)
	at org.apache.maven.lifecycle.internal.LifecycleStarter.singleThreadedBuild(LifecycleStarter.java:183)
	at org.apache.maven.lifecycle.internal.LifecycleStarter.execute(LifecycleStarter.java:161)
	at org.apache.maven.DefaultMaven.doExecute(DefaultMaven.java:319)
	at org.apache.maven.DefaultMaven.execute(DefaultMaven.java:156)
	at org.apache.maven.cli.MavenCli.execute(MavenCli.java:537)
	at org.apache.maven.cli.MavenCli.doMain(MavenCli.java:196)
	at org.apache.maven.cli.MavenCli.main(MavenCli.java:141)
	at sun.reflect.NativeMethodAccessorImpl.invoke0(Native Method)
	at sun.reflect.NativeMethodAccessorImpl.invoke(NativeMethodAccessorImpl.java:57)
	at sun.reflect.DelegatingMethodAccessorImpl.invoke(DelegatingMethodAccessorImpl.java:43)
	at java.lang.reflect.Method.invoke(Method.java:606)
	at org.codehaus.plexus.classworlds.launcher.Launcher.launchEnhanced(Launcher.java:290)
	at org.codehaus.plexus.classworlds.launcher.Launcher.launch(Launcher.java:230)
	at org.codehaus.plexus.classworlds.launcher.Launcher.mainWithExitCode(Launcher.java:409)
	at org.codehaus.plexus.classworlds.launcher.Launcher.main(Launcher.java:352)
Caused by: org.apache.maven.plugin.MojoFailureException: There are test failures.

Please refer to <https://integration.onehippo.com/job/Repository%20Integration%20Trunk/ws/test/target/failsafe-reports> for the individual test results.
	at org.apache.maven.plugin.surefire.SurefireHelper.reportExecution(SurefireHelper.java:82)
	at org.apache.maven.plugin.failsafe.VerifyMojo.execute(VerifyMojo.java:194)
	at org.apache.maven.plugin.DefaultBuildPluginManager.executeMojo(DefaultBuildPluginManager.java:101)
	at org.apache.maven.lifecycle.internal.MojoExecutor.execute(MojoExecutor.java:209)
	... 19 more
[ERROR] 
[ERROR] Re-run Maven using the -X switch to enable full debug logging.
[ERROR] 
[ERROR] For more information about the errors and possible solutions, please read the following articles:
[ERROR] [Help 1] http://cwiki.apache.org/confluence/display/MAVEN/MojoFailureException
[ERROR] 
[ERROR] After correcting the problems, you can resume the build with the command
[ERROR]   mvn <goals> -rf :hippo-repository-test
[DEBUG] Waiting for process to finish
[DEBUG] Result: 1
Recording test results

--
This message is automatically generated by Hudson. 
For more information on Hudson, see: http://hudson-ci.org/


More information about the Hippo-cms7-dev mailing list