[Hippo-cms7-dev] [Hudson] Build failed in Hudson: testsuite-1.04.xx » Hippo Test Suite Components #30

Hippo Public Hudson Server beheer at onehippo.com
Tue Nov 19 11:17:36 CET 2013


See <https://builds.onehippo.org/job/testsuite-1.04.xx/org.onehippo.cms7$hippo-testsuite-components/30/>

------------------------------------------
[HUDSON] Archiving /var/hudson-data/jobs/testsuite-1.04.xx/workspace/content/pom.xml to /var/hudson-data/jobs/testsuite-1.04.xx/modules/org.onehippo.cms7$hippo-testsuite-content/builds/2013-11-19_11-17-01/archive/org.onehippo.cms7/hippo-testsuite-content/1.04.06-SNAPSHOT/pom.xml
[HUDSON] Archiving /var/hudson-data/jobs/testsuite-1.04.xx/workspace/content/target/hippo-testsuite-content-1.04.06-SNAPSHOT.jar to /var/hudson-data/jobs/testsuite-1.04.xx/modules/org.onehippo.cms7$hippo-testsuite-content/builds/2013-11-19_11-17-01/archive/org.onehippo.cms7/hippo-testsuite-content/1.04.06-20131119.101724-17/hippo-testsuite-content-1.04.06-SNAPSHOT.jar
[HUDSON] Archiving /var/hudson-data/jobs/testsuite-1.04.xx/workspace/content/target/hippo-testsuite-content-1.04.06-SNAPSHOT-sources.jar to /var/hudson-data/jobs/testsuite-1.04.xx/modules/org.onehippo.cms7$hippo-testsuite-content/builds/2013-11-19_11-17-01/archive/org.onehippo.cms7/hippo-testsuite-content/1.04.06-20131119.101724-17/hippo-testsuite-content-1.04.06-SNAPSHOT-sources.jar
[INFO]                                                                         
[INFO] ------------------------------------------------------------------------
[INFO] Building Hippo Test Suite Components 1.04.06-SNAPSHOT
[INFO] ------------------------------------------------------------------------
Downloading: http://maven.onehippo.com/maven2-snapshots/org/onehippo/cms7/hst/hst-solr-client/2.26.08/hst-solr-client-2.26.08.pom
Downloading: http://maven.onehippo.com/maven2/org/onehippo/cms7/hst/hst-solr-client/2.26.08/hst-solr-client-2.26.08.pom
Downloaded: http://maven.onehippo.com/maven2/org/onehippo/cms7/hst/hst-solr-client/2.26.08/hst-solr-client-2.26.08.pom (3 KB at 9.0 KB/sec)
Downloading: http://maven.onehippo.com/maven2-snapshots/org/onehippo/cms7/hst/hst-solr-content-beans/2.26.08/hst-solr-content-beans-2.26.08.pom
Downloading: http://maven.onehippo.com/maven2/org/onehippo/cms7/hst/hst-solr-content-beans/2.26.08/hst-solr-content-beans-2.26.08.pom
Downloaded: http://maven.onehippo.com/maven2/org/onehippo/cms7/hst/hst-solr-content-beans/2.26.08/hst-solr-content-beans-2.26.08.pom (2 KB at 13.7 KB/sec)
Downloading: http://maven.onehippo.com/maven2-snapshots/org/onehippo/cms7/hst/hst-solr-client/2.26.08/hst-solr-client-2.26.08.jar
Downloading: http://maven.onehippo.com/maven2-snapshots/org/onehippo/cms7/hst/hst-solr-content-beans/2.26.08/hst-solr-content-beans-2.26.08.jar
Downloading: http://maven.onehippo.com/maven2/org/onehippo/cms7/hst/hst-solr-client/2.26.08/hst-solr-client-2.26.08.jar
Downloading: http://maven.onehippo.com/maven2/org/onehippo/cms7/hst/hst-solr-content-beans/2.26.08/hst-solr-content-beans-2.26.08.jar
Downloaded: http://maven.onehippo.com/maven2/org/onehippo/cms7/hst/hst-solr-content-beans/2.26.08/hst-solr-content-beans-2.26.08.jar (35 KB at 308.7 KB/sec)
Downloaded: http://maven.onehippo.com/maven2/org/onehippo/cms7/hst/hst-solr-client/2.26.08/hst-solr-client-2.26.08.jar (14 KB at 115.2 KB/sec)
[INFO] 
[INFO] --- maven-remote-resources-plugin:1.4:process (default) @ hippo-testsuite-components ---
[INFO] 
[INFO] --- maven-resources-plugin:2.6:resources (default-resources) @ hippo-testsuite-components ---
[INFO] Using 'UTF-8' encoding to copy filtered resources.
[INFO] Copying 21 resources
[INFO] 
[INFO] --- maven-compiler-plugin:2.5.1:compile (default-compile) @ hippo-testsuite-components ---
[INFO] Compiling 84 source files to <https://builds.onehippo.org/job/testsuite-1.04.xx/org.onehippo.cms7$hippo-testsuite-components/ws/target/classes>
[INFO] -------------------------------------------------------------
[ERROR] COMPILATION ERROR : 
[INFO] -------------------------------------------------------------
[ERROR] <https://builds.onehippo.org/job/testsuite-1.04.xx/org.onehippo.cms7$hippo-testsuite-components/ws/src/main/java/org/hippoecm/hst/demo/container/HttpsSchemeExampleValve.java>:[21,38] error: cannot find symbol
[ERROR]   symbol:   class AbstractHttpsSchemeValve
  location: package org.hippoecm.hst.core.container
<https://builds.onehippo.org/job/testsuite-1.04.xx/org.onehippo.cms7$hippo-testsuite-components/ws/src/main/java/org/hippoecm/hst/demo/container/HttpsSchemeExampleValve.java>:[25,45] error: cannot find symbol
[ERROR]   symbol: class AbstractHttpsSchemeValve
<https://builds.onehippo.org/job/testsuite-1.04.xx/org.onehippo.cms7$hippo-testsuite-components/ws/src/main/java/org/hippoecm/hst/demo/container/HttpsSchemeExampleValve.java>:[27,4] error: method does not override or implement a method from a supertype
[ERROR] <https://builds.onehippo.org/job/testsuite-1.04.xx/org.onehippo.cms7$hippo-testsuite-components/ws/src/main/java/org/hippoecm/hst/demo/container/HttpsSchemeExampleValve.java>:[40,4] error: method does not override or implement a method from a supertype
[INFO] 4 errors 
[INFO] -------------------------------------------------------------
mojoFailed org.apache.maven.plugins:maven-compiler-plugin:2.5.1(default-compile)
projectFailed org.onehippo.cms7:hippo-testsuite-components:1.04.06-SNAPSHOT

--
This message is automatically generated by Hudson. 
For more information on Hudson, see: http://hudson-ci.org/


More information about the Hippo-cms7-dev mailing list