[Hippo-cms7-dev] [Hudson] Build failed in Hudson: Repository Integration Trunk #745

Hippo Integration Hudson Server beheer at onehippo.com
Wed Nov 20 10:09:30 CET 2013


See <https://integration.onehippo.com/job/Repository%20Integration%20Trunk/745/changes>

Changes:

[adouma] REPO-836rollback changes from release preparation of scxml-workflow

[adouma] REPO-836prepare branch scxml-workflow

[aschrijvers] REPO-835 do not encode within the [] where clause brackets as it is error prone

------------------------------------------
[...truncated 1632 lines...]
	at org.hippoecm.repository.jackrabbit.HippoLocalItemStateManager.update(HippoLocalItemStateManager.java:289)
	at org.apache.jackrabbit.core.version.VersionManagerImplBase$WriteOperation.save(VersionManagerImplBase.java:470)
	at org.apache.jackrabbit.core.version.VersionManagerImplBase.checkoutCheckin(VersionManagerImplBase.java:215)
	... 19 more
20.11.2013 10:03:15 ERROR [org.hippoecm.repository.standardworkflow.FolderWorkflowImpl.doArchive():385] error while deleting document variants from attic
javax.jcr.RepositoryException: org.apache.jackrabbit.core.state.StaleItemStateException: 7eadcdd4-0b60-4a27-bbfa-142354ac80e8/{http://www.jcp.org/jcr/1.0}isCheckedOut has been modified externally
	at org.apache.jackrabbit.core.version.VersionManagerImplBase.checkoutCheckin(VersionManagerImplBase.java:218)
	at org.apache.jackrabbit.core.VersionManagerImpl.access$400(VersionManagerImpl.java:73)
	at org.apache.jackrabbit.core.VersionManagerImpl$3.perform(VersionManagerImpl.java:161)
	at org.apache.jackrabbit.core.VersionManagerImpl$3.perform(VersionManagerImpl.java:154)
	at org.apache.jackrabbit.core.session.SessionState.perform(SessionState.java:216)
	at org.apache.jackrabbit.core.VersionManagerImpl.perform(VersionManagerImpl.java:96)
	at org.apache.jackrabbit.core.VersionManagerImpl.checkpoint(VersionManagerImpl.java:154)
	at org.hippoecm.repository.impl.VersionManagerDecorator.checkpoint(VersionManagerDecorator.java:75)
	at org.hippoecm.repository.standardworkflow.FolderWorkflowImpl.doArchive(FolderWorkflowImpl.java:375)
	at org.hippoecm.repository.standardworkflow.FolderWorkflowImpl.archive(FolderWorkflowImpl.java:459)
	at sun.reflect.GeneratedMethodAccessor9.invoke(Unknown Source)
	at sun.reflect.DelegatingMethodAccessorImpl.invoke(DelegatingMethodAccessorImpl.java:43)
	at java.lang.reflect.Method.invoke(Method.java:606)
	at org.hippoecm.repository.impl.WorkflowManagerImpl$WorkflowInvocationImpl.invoke(WorkflowManagerImpl.java:870)
	at org.hippoecm.repository.impl.WorkflowManagerImpl$WorkflowInvocationHandler.invoke(WorkflowManagerImpl.java:541)
	at com.sun.proxy.$Proxy22.delete(Unknown Source)
	at org.hippoecm.repository.concurrent.action.DeleteDocumentAction.doExecute(DeleteDocumentAction.java:29)
	at org.hippoecm.repository.concurrent.action.Action.execute(Action.java:44)
	at org.hippoecm.repository.concurrent.AbstractRandomActionTest$RandomActionRunner.step(AbstractRandomActionTest.java:251)
	at org.hippoecm.repository.concurrent.AbstractRandomActionTest$RandomActionRunner.run(AbstractRandomActionTest.java:192)
Caused by: org.apache.jackrabbit.core.state.StaleItemStateException: 7eadcdd4-0b60-4a27-bbfa-142354ac80e8/{http://www.jcp.org/jcr/1.0}isCheckedOut has been modified externally
	at org.apache.jackrabbit.core.state.SharedItemStateManager$Update.begin(SharedItemStateManager.java:679)
	at org.apache.jackrabbit.core.state.SharedItemStateManager.beginUpdate(SharedItemStateManager.java:1507)
	at org.apache.jackrabbit.core.state.SharedItemStateManager.update(SharedItemStateManager.java:1537)
	at org.hippoecm.repository.jackrabbit.HippoSharedItemStateManager.update(HippoSharedItemStateManager.java:90)
	at org.apache.jackrabbit.core.state.LocalItemStateManager.update(LocalItemStateManager.java:400)
	at org.apache.jackrabbit.core.state.XAItemStateManager.update(XAItemStateManager.java:354)
	at org.hippoecm.repository.jackrabbit.HippoLocalItemStateManager.update(HippoLocalItemStateManager.java:280)
	at org.apache.jackrabbit.core.state.LocalItemStateManager.update(LocalItemStateManager.java:375)
	at org.hippoecm.repository.jackrabbit.HippoLocalItemStateManager.update(HippoLocalItemStateManager.java:289)
	at org.apache.jackrabbit.core.version.VersionManagerImplBase$WriteOperation.save(VersionManagerImplBase.java:470)
	at org.apache.jackrabbit.core.version.VersionManagerImplBase.checkoutCheckin(VersionManagerImplBase.java:215)
	... 19 more
20.11.2013 10:03:16 ERROR [org.hippoecm.repository.standardworkflow.FolderWorkflowImpl.doArchive():385] error while deleting document variants from attic
javax.jcr.RepositoryException: org.apache.jackrabbit.core.state.StaleItemStateException: ea61e7fd-2a8e-4aae-937c-1c3e44ea4319/{http://www.jcp.org/jcr/1.0}isCheckedOut has been modified externally
	at org.apache.jackrabbit.core.version.VersionManagerImplBase.checkoutCheckin(VersionManagerImplBase.java:218)
	at org.apache.jackrabbit.core.VersionManagerImpl.access$400(VersionManagerImpl.java:73)
	at org.apache.jackrabbit.core.VersionManagerImpl$3.perform(VersionManagerImpl.java:161)
	at org.apache.jackrabbit.core.VersionManagerImpl$3.perform(VersionManagerImpl.java:154)
	at org.apache.jackrabbit.core.session.SessionState.perform(SessionState.java:216)
	at org.apache.jackrabbit.core.VersionManagerImpl.perform(VersionManagerImpl.java:96)
	at org.apache.jackrabbit.core.VersionManagerImpl.checkpoint(VersionManagerImpl.java:154)
	at org.hippoecm.repository.impl.VersionManagerDecorator.checkpoint(VersionManagerDecorator.java:75)
	at org.hippoecm.repository.standardworkflow.FolderWorkflowImpl.doArchive(FolderWorkflowImpl.java:375)
	at org.hippoecm.repository.standardworkflow.FolderWorkflowImpl.archive(FolderWorkflowImpl.java:459)
	at sun.reflect.GeneratedMethodAccessor9.invoke(Unknown Source)
	at sun.reflect.DelegatingMethodAccessorImpl.invoke(DelegatingMethodAccessorImpl.java:43)
	at java.lang.reflect.Method.invoke(Method.java:606)
	at org.hippoecm.repository.impl.WorkflowManagerImpl$WorkflowInvocationImpl.invoke(WorkflowManagerImpl.java:870)
	at org.hippoecm.repository.impl.WorkflowManagerImpl$WorkflowInvocationHandler.invoke(WorkflowManagerImpl.java:541)
	at com.sun.proxy.$Proxy22.delete(Unknown Source)
	at org.hippoecm.repository.concurrent.action.DeleteDocumentAction.doExecute(DeleteDocumentAction.java:29)
	at org.hippoecm.repository.concurrent.action.Action.execute(Action.java:44)
	at org.hippoecm.repository.concurrent.AbstractRandomActionTest$RandomActionRunner.step(AbstractRandomActionTest.java:251)
	at org.hippoecm.repository.concurrent.AbstractRandomActionTest$RandomActionRunner.run(AbstractRandomActionTest.java:192)
Caused by: org.apache.jackrabbit.core.state.StaleItemStateException: ea61e7fd-2a8e-4aae-937c-1c3e44ea4319/{http://www.jcp.org/jcr/1.0}isCheckedOut has been modified externally
	at org.apache.jackrabbit.core.state.SharedItemStateManager$Update.begin(SharedItemStateManager.java:679)
	at org.apache.jackrabbit.core.state.SharedItemStateManager.beginUpdate(SharedItemStateManager.java:1507)
	at org.apache.jackrabbit.core.state.SharedItemStateManager.update(SharedItemStateManager.java:1537)
	at org.hippoecm.repository.jackrabbit.HippoSharedItemStateManager.update(HippoSharedItemStateManager.java:90)
	at org.apache.jackrabbit.core.state.LocalItemStateManager.update(LocalItemStateManager.java:400)
	at org.apache.jackrabbit.core.state.XAItemStateManager.update(XAItemStateManager.java:354)
	at org.hippoecm.repository.jackrabbit.HippoLocalItemStateManager.update(HippoLocalItemStateManager.java:280)
	at org.apache.jackrabbit.core.state.LocalItemStateManager.update(LocalItemStateManager.java:375)
	at org.hippoecm.repository.jackrabbit.HippoLocalItemStateManager.update(HippoLocalItemStateManager.java:289)
	at org.apache.jackrabbit.core.version.VersionManagerImplBase$WriteOperation.save(VersionManagerImplBase.java:470)
	at org.apache.jackrabbit.core.version.VersionManagerImplBase.checkoutCheckin(VersionManagerImplBase.java:215)
	... 19 more
GetDocumentBaseNodeAction executed 244 times; missed 0 failed 0 times; total time spent 12 ms; average time 0
GetAssetBaseNodeAction executed 113 times; missed 0 failed 0 times; total time spent 0 ms; average time 0
GetRandomChildNodeAction executed 527 times; missed 0 failed 0 times; total time spent 112 ms; average time 0
AddDocumentFolderAction executed 34 times; missed 0 failed 0 times; total time spent 1300 ms; average time 38
AddAssetFolderAction executed 45 times; missed 0 failed 0 times; total time spent 2376 ms; average time 52
AddNewsDocumentAction executed 167 times; missed 0 failed 0 times; total time spent 12772 ms; average time 76
PublishAction executed 45 times; missed 6 failed 0 times; total time spent 9012 ms; average time 200
DepublishAction executed 32 times; missed 0 failed 0 times; total time spent 5108 ms; average time 159
DeleteDocumentAction executed 105 times; missed 0 failed 0 times; total time spent 31756 ms; average time 302
LoadDocumentAction executed 315 times; missed 0 failed 0 times; total time spent 324 ms; average time 1
AddDocumentLinkAction executed 116 times; missed 0 failed 0 times; total time spent 11384 ms; average time 98
EditDocumentAction executed 120 times; missed 1 failed 0 times; total time spent 18944 ms; average time 157
AddAssetAction executed 54 times; missed 0 failed 0 times; total time spent 8716 ms; average time 161
DeleteAssetAction executed 37 times; missed 0 failed 0 times; total time spent 1980 ms; average time 53
RenameAssetAction executed 33 times; missed 0 failed 0 times; total time spent 2668 ms; average time 80
DeleteFolderAction executed 30 times; missed 0 failed 0 times; total time spent 1120 ms; average time 37
RenameDocumentAction executed 104 times; missed 2 failed 0 times; total time spent 7624 ms; average time 73
MoveDocumentAction executed 81 times; missed 0 failed 0 times; total time spent 7388 ms; average time 91
Total actions run: 2202
Total successful actions: 2193
Total write actions run: 1003
Total missed actions: 9
Total failed actions: 0
Successrate: 1.0
Total time it took: 60.032 sec
Tests run: 1, Failures: 0, Errors: 0, Skipped: 0, Time elapsed: 82.72 sec - in org.hippoecm.repository.concurrent.StampedeTest
Running org.hippoecm.repository.updater.UpdaterTest
Tests run: 3, Failures: 0, Errors: 0, Skipped: 0, Time elapsed: 10.412 sec - in org.hippoecm.repository.updater.UpdaterTest
Running org.hippoecm.repository.sample.SampleRemoteWorkflowTest
Tests run: 2, Failures: 0, Errors: 0, Skipped: 0, Time elapsed: 12.992 sec - in org.hippoecm.repository.sample.SampleRemoteWorkflowTest
Running org.hippoecm.repository.facetnavigation.FacetedNavigationConcurrencyTest
Tests run: 4, Failures: 0, Errors: 0, Skipped: 0, Time elapsed: 59.836 sec - in org.hippoecm.repository.facetnavigation.FacetedNavigationConcurrencyTest
Running org.hippoecm.repository.TotalSizeTest
Tests run: 4, Failures: 0, Errors: 0, Skipped: 0, Time elapsed: 19.7 sec - in org.hippoecm.repository.TotalSizeTest
Running org.hippoecm.repository.test.RemoteTest
Tests run: 1, Failures: 0, Errors: 0, Skipped: 1, Time elapsed: 0 sec - in org.hippoecm.repository.test.RemoteTest
Running org.hippoecm.repository.test.WorkflowChainingTest
Tests run: 2, Failures: 0, Errors: 0, Skipped: 0, Time elapsed: 34.688 sec - in org.hippoecm.repository.test.WorkflowChainingTest
Running org.hippoecm.repository.decorating.MirrorTest
Tests run: 4, Failures: 0, Errors: 0, Skipped: 0, Time elapsed: 29.528 sec - in org.hippoecm.repository.decorating.MirrorTest
Running org.hippoecm.repository.quartz.SchedulerTest
20.11.2013 10:06:17 ERROR [org.hippoecm.repository.quartz.JCRJobStore.triggerFired():370] Failed to verify job
org.quartz.JobPersistenceException: No such job: 724a8d40-02f6-4d59-94b1-73d6615e7eb1
	at org.hippoecm.repository.quartz.JCRJobStore.retrieveJob(JCRJobStore.java:173)
	at org.hippoecm.repository.quartz.JCRJobStore.triggerFired(JCRJobStore.java:365)
	at org.quartz.core.QuartzSchedulerThread.run(QuartzSchedulerThread.java:320)
Tests run: 5, Failures: 0, Errors: 2, Skipped: 0, Time elapsed: 174.912 sec <<< FAILURE! - in org.hippoecm.repository.quartz.SchedulerTest
testScheduleAndDeleteRepositoryJob(org.hippoecm.repository.quartz.SchedulerTest)  Time elapsed: 0.04 sec  <<< ERROR!
javax.jcr.RepositoryException: A job with name 'test' already exists in job group 'default'
	at org.hippoecm.repository.quartz.RepositorySchedulerImpl.newJobNode(RepositorySchedulerImpl.java:162)
	at org.hippoecm.repository.quartz.RepositorySchedulerImpl.createQuartzJobDetail(RepositorySchedulerImpl.java:148)
	at org.hippoecm.repository.quartz.RepositorySchedulerImpl.scheduleJob(RepositorySchedulerImpl.java:64)
	at sun.reflect.NativeMethodAccessorImpl.invoke0(Native Method)
	at sun.reflect.NativeMethodAccessorImpl.invoke(NativeMethodAccessorImpl.java:57)
	at sun.reflect.DelegatingMethodAccessorImpl.invoke(DelegatingMethodAccessorImpl.java:43)
	at java.lang.reflect.Method.invoke(Method.java:606)
	at org.onehippo.cms7.services.HippoServiceRegistry$NamedRegistration$1.invoke(HippoServiceRegistry.java:54)
	at com.sun.proxy.$Proxy16.scheduleJob(Unknown Source)
	at org.hippoecm.repository.quartz.SchedulerTest.testScheduleAndDeleteRepositoryJob(SchedulerTest.java:90)

testTriggerRepositoryJobNow(org.hippoecm.repository.quartz.SchedulerTest)  Time elapsed: 0.04 sec  <<< ERROR!
javax.jcr.RepositoryException: A job with name 'test' already exists in job group 'default'
	at org.hippoecm.repository.quartz.RepositorySchedulerImpl.newJobNode(RepositorySchedulerImpl.java:162)
	at org.hippoecm.repository.quartz.RepositorySchedulerImpl.createQuartzJobDetail(RepositorySchedulerImpl.java:148)
	at org.hippoecm.repository.quartz.RepositorySchedulerImpl.scheduleJob(RepositorySchedulerImpl.java:64)
	at sun.reflect.NativeMethodAccessorImpl.invoke0(Native Method)
	at sun.reflect.NativeMethodAccessorImpl.invoke(NativeMethodAccessorImpl.java:57)
	at sun.reflect.DelegatingMethodAccessorImpl.invoke(DelegatingMethodAccessorImpl.java:43)
	at java.lang.reflect.Method.invoke(Method.java:606)
	at org.onehippo.cms7.services.HippoServiceRegistry$NamedRegistration$1.invoke(HippoServiceRegistry.java:54)
	at com.sun.proxy.$Proxy16.scheduleJob(Unknown Source)
	at org.hippoecm.repository.quartz.SchedulerTest.testTriggerRepositoryJobNow(SchedulerTest.java:102)

Running org.onehippo.repository.update.UpdaterExecutorTest
Tests run: 3, Failures: 0, Errors: 0, Skipped: 0, Time elapsed: 24.74 sec - in org.onehippo.repository.update.UpdaterExecutorTest

Results :

Tests in error: 
  SchedulerTest.testScheduleAndDeleteRepositoryJob:90 ? Repository A job with na...
  SchedulerTest.testTriggerRepositoryJobNow:102 ? Repository A job with name 'te...

Tests run: 29, Failures: 0, Errors: 2, Skipped: 1

[WARNING] File encoding has not been set, using platform encoding ANSI_X3.4-1968, i.e. build is platform dependent!
[INFO] 
[INFO] --- maven-failsafe-plugin:2.16:verify (default) @ hippo-repository-test ---
[INFO] Failsafe report directory: <https://integration.onehippo.com/job/Repository%20Integration%20Trunk/ws/test/target/failsafe-reports>
[WARNING] File encoding has not been set, using platform encoding ANSI_X3.4-1968, i.e. build is platform dependent!
[INFO] ------------------------------------------------------------------------
[INFO] Reactor Summary:
[INFO] 
[INFO] Repository ........................................ SUCCESS [2.992s]
[INFO] Repository API .................................... SUCCESS [5.968s]
[INFO] Repository Utilities .............................. SUCCESS [2.164s]
[INFO] Repository Connector .............................. SUCCESS [4.272s]
[INFO] Repository Provider Module Interface .............. SUCCESS [1.832s]
[INFO] Repository Test Utilities ......................... SUCCESS [3.508s]
[INFO] Repository Builtin workflow ....................... SUCCESS [1.100s]
[INFO] Repository Engine ................................. SUCCESS [2:12.388s]
[INFO] Repository Default Configuration .................. SUCCESS [22.204s]
[INFO] Repository Modules ................................ SUCCESS [26.860s]
[INFO] Repository Test Content ........................... SUCCESS [0.208s]
[INFO] Repository Deprecated ............................. SUCCESS [0.096s]
[INFO] Repository Deprecated Facetselect Mirror .......... SUCCESS [21.468s]
[INFO] Repository workflow implementations ............... SUCCESS [8:13.308s]
[INFO] Repository Deprecated Translation ................. SUCCESS [21.548s]
[INFO] Repository Deprecated Facetsearch ................. SUCCESS [31.236s]
[INFO] Repository Upgrade Module ......................... SUCCESS [11.956s]
[INFO] Repository Upgrade ................................ SUCCESS [0.080s]
[INFO] Repository Handle Migration ....................... SUCCESS [32.820s]
[INFO] Repository Upgrade XML Bootstrap Migration ........ SUCCESS [3.904s]
[INFO] Repository Test ................................... FAILURE [9:39.776s]
[INFO] Repository LDAP based Authorization ............... SKIPPED
[INFO] Repository Resources .............................. SKIPPED
[INFO] Repository Servlets ............................... SKIPPED
[INFO] Repository Dependencies ........................... SKIPPED
[INFO] ------------------------------------------------------------------------
[INFO] BUILD FAILURE
[INFO] ------------------------------------------------------------------------
[INFO] Total time: 23:23.012s
[INFO] Finished at: Wed Nov 20 10:09:28 CET 2013
[INFO] Final Memory: 21M/168M
[INFO] ------------------------------------------------------------------------
[INFO] o.h.m.e.h.MavenExecutionResultHandler - Build failed with exception(s)
[INFO] o.h.m.e.h.MavenExecutionResultHandler - [1] org.apache.maven.lifecycle.LifecycleExecutionException: Failed to execute goal org.apache.maven.plugins:maven-failsafe-plugin:2.16:verify (default) on project hippo-repository-test: There are test failures.

Please refer to <https://integration.onehippo.com/job/Repository%20Integration%20Trunk/ws/test/target/failsafe-reports> for the individual test results.
[DEBUG] Closing connection to remote
[ERROR] Failed to execute goal org.apache.maven.plugins:maven-failsafe-plugin:2.16:verify (default) on project hippo-repository-test: There are test failures.
[ERROR] 
[ERROR] Please refer to <https://integration.onehippo.com/job/Repository%20Integration%20Trunk/ws/test/target/failsafe-reports> for the individual test results.
[ERROR] -> [Help 1]
org.apache.maven.lifecycle.LifecycleExecutionException: Failed to execute goal org.apache.maven.plugins:maven-failsafe-plugin:2.16:verify (default) on project hippo-repository-test: There are test failures.

Please refer to <https://integration.onehippo.com/job/Repository%20Integration%20Trunk/ws/test/target/failsafe-reports> for the individual test results.
	at org.apache.maven.lifecycle.internal.MojoExecutor.execute(MojoExecutor.java:213)
	at org.apache.maven.lifecycle.internal.MojoExecutor.execute(MojoExecutor.java:153)
	at org.apache.maven.lifecycle.internal.MojoExecutor.execute(MojoExecutor.java:145)
	at org.apache.maven.lifecycle.internal.LifecycleModuleBuilder.buildProject(LifecycleModuleBuilder.java:84)
	at org.apache.maven.lifecycle.internal.LifecycleModuleBuilder.buildProject(LifecycleModuleBuilder.java:59)
	at org.apache.maven.lifecycle.internal.LifecycleStarter.singleThreadedBuild(LifecycleStarter.java:183)
	at org.apache.maven.lifecycle.internal.LifecycleStarter.execute(LifecycleStarter.java:161)
	at org.apache.maven.DefaultMaven.doExecute(DefaultMaven.java:319)
	at org.apache.maven.DefaultMaven.execute(DefaultMaven.java:156)
	at org.apache.maven.cli.MavenCli.execute(MavenCli.java:537)
	at org.apache.maven.cli.MavenCli.doMain(MavenCli.java:196)
	at org.apache.maven.cli.MavenCli.main(MavenCli.java:141)
	at sun.reflect.NativeMethodAccessorImpl.invoke0(Native Method)
	at sun.reflect.NativeMethodAccessorImpl.invoke(NativeMethodAccessorImpl.java:57)
	at sun.reflect.DelegatingMethodAccessorImpl.invoke(DelegatingMethodAccessorImpl.java:43)
	at java.lang.reflect.Method.invoke(Method.java:606)
	at org.codehaus.plexus.classworlds.launcher.Launcher.launchEnhanced(Launcher.java:290)
	at org.codehaus.plexus.classworlds.launcher.Launcher.launch(Launcher.java:230)
	at org.codehaus.plexus.classworlds.launcher.Launcher.mainWithExitCode(Launcher.java:409)
	at org.codehaus.plexus.classworlds.launcher.Launcher.main(Launcher.java:352)
Caused by: org.apache.maven.plugin.MojoFailureException: There are test failures.

Please refer to <https://integration.onehippo.com/job/Repository%20Integration%20Trunk/ws/test/target/failsafe-reports> for the individual test results.
	at org.apache.maven.plugin.surefire.SurefireHelper.reportExecution(SurefireHelper.java:82)
	at org.apache.maven.plugin.failsafe.VerifyMojo.execute(VerifyMojo.java:194)
	at org.apache.maven.plugin.DefaultBuildPluginManager.executeMojo(DefaultBuildPluginManager.java:101)
	at org.apache.maven.lifecycle.internal.MojoExecutor.execute(MojoExecutor.java:209)
	... 19 more
[ERROR] 
[ERROR] Re-run Maven using the -X switch to enable full debug logging.
[ERROR] 
[ERROR] For more information about the errors and possible solutions, please read the following articles:
[ERROR] [Help 1] http://cwiki.apache.org/confluence/display/MAVEN/MojoFailureException
[ERROR] 
[ERROR] After correcting the problems, you can resume the build with the command
[ERROR]   mvn <goals> -rf :hippo-repository-test
[DEBUG] Waiting for process to finish
[DEBUG] Result: 1
Recording test results

--
This message is automatically generated by Hudson. 
For more information on Hudson, see: http://hudson-ci.org/


More information about the Hippo-cms7-dev mailing list