[Hippo-cms7-dev] [Hudson] Build failed in Hudson: Repository Integration Trunk #746

Hippo Integration Hudson Server beheer at onehippo.com
Thu Nov 21 10:09:30 CET 2013


See <https://integration.onehippo.com/job/Repository%20Integration%20Trunk/746/changes>

Changes:

[Unico Hommes] REPO-839 remove logic to disable migration module during test: no longer applicable; make sure only hardhandles in the attic are migrated (test failure due to unexpected test ordering)

[Unico Hommes] REPO-840 check whether the document is versionable before attempting to retrieve its version history. Remove the logic for traversing the handle version history.

[Unico Hommes] REPO-835 moved utility method to RepoUtils class

[adouma] REPO-1: fix license headers

[Unico Hommes] REPO-839 license header

[Unico Hommes] REPO-838 REPO-839 NodeUpdateVisitors must not log out the session they receive via initialize.

[Unico Hommes] REPO-839 make sure we operate on a handle node instance that belongs to the session we use

[Unico Hommes] REPO-838 give back the instantiated and initialized updater instead of the class. in this way we can ensure the updater has a privileged session and that the updater has all the necessary access rights

[Unico Hommes] REPO-839 Rewrite hardhandle and harddocument migrators as updater visitors

[Unico Hommes] REPO-838 Add ability to register Updaters by node type and supply a updater registry service for retrieving registered updaters for a given node

[aschrijvers] REPO-832 make the isGranted shortcut configurable in case a customer relies on hierarchical authorization configuration and still requires exact total size counts

------------------------------------------
[...truncated 1657 lines...]
	at sun.reflect.GeneratedMethodAccessor7.invoke(Unknown Source)
	at sun.reflect.DelegatingMethodAccessorImpl.invoke(DelegatingMethodAccessorImpl.java:43)
	at java.lang.reflect.Method.invoke(Method.java:606)
	at org.hippoecm.repository.impl.WorkflowManagerImpl$WorkflowInvocationImpl.invoke(WorkflowManagerImpl.java:870)
	at org.hippoecm.repository.impl.WorkflowManagerImpl$WorkflowInvocationHandler.invoke(WorkflowManagerImpl.java:541)
	at com.sun.proxy.$Proxy22.delete(Unknown Source)
	at org.hippoecm.repository.concurrent.action.DeleteDocumentAction.doExecute(DeleteDocumentAction.java:29)
	at org.hippoecm.repository.concurrent.action.Action.execute(Action.java:44)
	at org.hippoecm.repository.concurrent.AbstractRandomActionTest$RandomActionRunner.step(AbstractRandomActionTest.java:251)
	at org.hippoecm.repository.concurrent.AbstractRandomActionTest$RandomActionRunner.run(AbstractRandomActionTest.java:192)
Caused by: org.apache.jackrabbit.core.state.StaleItemStateException: 0dfa07a3-52d8-4f70-b3d2-e1c5e2b807b6/{http://www.jcp.org/jcr/1.0}isCheckedOut has been modified externally
	at org.apache.jackrabbit.core.state.SharedItemStateManager$Update.begin(SharedItemStateManager.java:679)
	at org.apache.jackrabbit.core.state.SharedItemStateManager.beginUpdate(SharedItemStateManager.java:1507)
	at org.apache.jackrabbit.core.state.SharedItemStateManager.update(SharedItemStateManager.java:1537)
	at org.hippoecm.repository.jackrabbit.HippoSharedItemStateManager.update(HippoSharedItemStateManager.java:90)
	at org.apache.jackrabbit.core.state.LocalItemStateManager.update(LocalItemStateManager.java:400)
	at org.apache.jackrabbit.core.state.XAItemStateManager.update(XAItemStateManager.java:354)
	at org.hippoecm.repository.jackrabbit.HippoLocalItemStateManager.update(HippoLocalItemStateManager.java:280)
	at org.apache.jackrabbit.core.state.LocalItemStateManager.update(LocalItemStateManager.java:375)
	at org.hippoecm.repository.jackrabbit.HippoLocalItemStateManager.update(HippoLocalItemStateManager.java:289)
	at org.apache.jackrabbit.core.version.VersionManagerImplBase$WriteOperation.save(VersionManagerImplBase.java:470)
	at org.apache.jackrabbit.core.version.VersionManagerImplBase.checkoutCheckin(VersionManagerImplBase.java:215)
	... 19 more
21.11.2013 10:03:11 ERROR [org.hippoecm.repository.standardworkflow.FolderWorkflowImpl.doArchive():385] error while deleting document variants from attic
javax.jcr.RepositoryException: org.apache.jackrabbit.core.state.StaleItemStateException: 676b80b2-2bc4-4b73-9bdc-b2748de39040/{http://www.jcp.org/jcr/1.0}isCheckedOut has been modified externally
	at org.apache.jackrabbit.core.version.VersionManagerImplBase.checkoutCheckin(VersionManagerImplBase.java:218)
	at org.apache.jackrabbit.core.VersionManagerImpl.access$400(VersionManagerImpl.java:73)
	at org.apache.jackrabbit.core.VersionManagerImpl$3.perform(VersionManagerImpl.java:161)
	at org.apache.jackrabbit.core.VersionManagerImpl$3.perform(VersionManagerImpl.java:154)
	at org.apache.jackrabbit.core.session.SessionState.perform(SessionState.java:216)
	at org.apache.jackrabbit.core.VersionManagerImpl.perform(VersionManagerImpl.java:96)
	at org.apache.jackrabbit.core.VersionManagerImpl.checkpoint(VersionManagerImpl.java:154)
	at org.hippoecm.repository.impl.VersionManagerDecorator.checkpoint(VersionManagerDecorator.java:75)
	at org.hippoecm.repository.standardworkflow.FolderWorkflowImpl.doArchive(FolderWorkflowImpl.java:375)
	at org.hippoecm.repository.standardworkflow.FolderWorkflowImpl.archive(FolderWorkflowImpl.java:459)
	at sun.reflect.GeneratedMethodAccessor7.invoke(Unknown Source)
	at sun.reflect.DelegatingMethodAccessorImpl.invoke(DelegatingMethodAccessorImpl.java:43)
	at java.lang.reflect.Method.invoke(Method.java:606)
	at org.hippoecm.repository.impl.WorkflowManagerImpl$WorkflowInvocationImpl.invoke(WorkflowManagerImpl.java:870)
	at org.hippoecm.repository.impl.WorkflowManagerImpl$WorkflowInvocationHandler.invoke(WorkflowManagerImpl.java:541)
	at com.sun.proxy.$Proxy22.delete(Unknown Source)
	at org.hippoecm.repository.concurrent.action.DeleteDocumentAction.doExecute(DeleteDocumentAction.java:29)
	at org.hippoecm.repository.concurrent.action.Action.execute(Action.java:44)
	at org.hippoecm.repository.concurrent.AbstractRandomActionTest$RandomActionRunner.step(AbstractRandomActionTest.java:251)
	at org.hippoecm.repository.concurrent.AbstractRandomActionTest$RandomActionRunner.run(AbstractRandomActionTest.java:192)
Caused by: org.apache.jackrabbit.core.state.StaleItemStateException: 676b80b2-2bc4-4b73-9bdc-b2748de39040/{http://www.jcp.org/jcr/1.0}isCheckedOut has been modified externally
	at org.apache.jackrabbit.core.state.SharedItemStateManager$Update.begin(SharedItemStateManager.java:679)
	at org.apache.jackrabbit.core.state.SharedItemStateManager.beginUpdate(SharedItemStateManager.java:1507)
	at org.apache.jackrabbit.core.state.SharedItemStateManager.update(SharedItemStateManager.java:1537)
	at org.hippoecm.repository.jackrabbit.HippoSharedItemStateManager.update(HippoSharedItemStateManager.java:90)
	at org.apache.jackrabbit.core.state.LocalItemStateManager.update(LocalItemStateManager.java:400)
	at org.apache.jackrabbit.core.state.XAItemStateManager.update(XAItemStateManager.java:354)
	at org.hippoecm.repository.jackrabbit.HippoLocalItemStateManager.update(HippoLocalItemStateManager.java:280)
	at org.apache.jackrabbit.core.state.LocalItemStateManager.update(LocalItemStateManager.java:375)
	at org.hippoecm.repository.jackrabbit.HippoLocalItemStateManager.update(HippoLocalItemStateManager.java:289)
	at org.apache.jackrabbit.core.version.VersionManagerImplBase$WriteOperation.save(VersionManagerImplBase.java:470)
	at org.apache.jackrabbit.core.version.VersionManagerImplBase.checkoutCheckin(VersionManagerImplBase.java:215)
	... 19 more
21.11.2013 10:03:14 ERROR [org.hippoecm.repository.standardworkflow.FolderWorkflowImpl.doArchive():385] error while deleting document variants from attic
javax.jcr.RepositoryException: org.apache.jackrabbit.core.state.StaleItemStateException: a05d6c01-3939-4680-8969-c841cafabd5f/{http://www.jcp.org/jcr/1.0}isCheckedOut has been modified externally
	at org.apache.jackrabbit.core.version.VersionManagerImplBase.checkoutCheckin(VersionManagerImplBase.java:218)
	at org.apache.jackrabbit.core.VersionManagerImpl.access$400(VersionManagerImpl.java:73)
	at org.apache.jackrabbit.core.VersionManagerImpl$3.perform(VersionManagerImpl.java:161)
	at org.apache.jackrabbit.core.VersionManagerImpl$3.perform(VersionManagerImpl.java:154)
	at org.apache.jackrabbit.core.session.SessionState.perform(SessionState.java:216)
	at org.apache.jackrabbit.core.VersionManagerImpl.perform(VersionManagerImpl.java:96)
	at org.apache.jackrabbit.core.VersionManagerImpl.checkpoint(VersionManagerImpl.java:154)
	at org.hippoecm.repository.impl.VersionManagerDecorator.checkpoint(VersionManagerDecorator.java:75)
	at org.hippoecm.repository.standardworkflow.FolderWorkflowImpl.doArchive(FolderWorkflowImpl.java:375)
	at org.hippoecm.repository.standardworkflow.FolderWorkflowImpl.archive(FolderWorkflowImpl.java:459)
	at sun.reflect.GeneratedMethodAccessor7.invoke(Unknown Source)
	at sun.reflect.DelegatingMethodAccessorImpl.invoke(DelegatingMethodAccessorImpl.java:43)
	at java.lang.reflect.Method.invoke(Method.java:606)
	at org.hippoecm.repository.impl.WorkflowManagerImpl$WorkflowInvocationImpl.invoke(WorkflowManagerImpl.java:870)
	at org.hippoecm.repository.impl.WorkflowManagerImpl$WorkflowInvocationHandler.invoke(WorkflowManagerImpl.java:541)
	at com.sun.proxy.$Proxy22.delete(Unknown Source)
	at org.hippoecm.repository.concurrent.action.DeleteDocumentAction.doExecute(DeleteDocumentAction.java:29)
	at org.hippoecm.repository.concurrent.action.Action.execute(Action.java:44)
	at org.hippoecm.repository.concurrent.AbstractRandomActionTest$RandomActionRunner.step(AbstractRandomActionTest.java:251)
	at org.hippoecm.repository.concurrent.AbstractRandomActionTest$RandomActionRunner.run(AbstractRandomActionTest.java:192)
Caused by: org.apache.jackrabbit.core.state.StaleItemStateException: a05d6c01-3939-4680-8969-c841cafabd5f/{http://www.jcp.org/jcr/1.0}isCheckedOut has been modified externally
	at org.apache.jackrabbit.core.state.SharedItemStateManager$Update.begin(SharedItemStateManager.java:679)
	at org.apache.jackrabbit.core.state.SharedItemStateManager.beginUpdate(SharedItemStateManager.java:1507)
	at org.apache.jackrabbit.core.state.SharedItemStateManager.update(SharedItemStateManager.java:1537)
	at org.hippoecm.repository.jackrabbit.HippoSharedItemStateManager.update(HippoSharedItemStateManager.java:90)
	at org.apache.jackrabbit.core.state.LocalItemStateManager.update(LocalItemStateManager.java:400)
	at org.apache.jackrabbit.core.state.XAItemStateManager.update(XAItemStateManager.java:354)
	at org.hippoecm.repository.jackrabbit.HippoLocalItemStateManager.update(HippoLocalItemStateManager.java:280)
	at org.apache.jackrabbit.core.state.LocalItemStateManager.update(LocalItemStateManager.java:375)
	at org.hippoecm.repository.jackrabbit.HippoLocalItemStateManager.update(HippoLocalItemStateManager.java:289)
	at org.apache.jackrabbit.core.version.VersionManagerImplBase$WriteOperation.save(VersionManagerImplBase.java:470)
	at org.apache.jackrabbit.core.version.VersionManagerImplBase.checkoutCheckin(VersionManagerImplBase.java:215)
	... 19 more
GetDocumentBaseNodeAction executed 307 times; missed 0 failed 0 times; total time spent 24 ms; average time 0
GetAssetBaseNodeAction executed 167 times; missed 0 failed 0 times; total time spent 4 ms; average time 0
GetRandomChildNodeAction executed 622 times; missed 0 failed 0 times; total time spent 72 ms; average time 0
AddDocumentFolderAction executed 39 times; missed 0 failed 0 times; total time spent 1396 ms; average time 35
AddAssetFolderAction executed 93 times; missed 0 failed 0 times; total time spent 3424 ms; average time 36
AddNewsDocumentAction executed 190 times; missed 0 failed 0 times; total time spent 11676 ms; average time 61
PublishAction executed 40 times; missed 3 failed 0 times; total time spent 6620 ms; average time 165
DepublishAction executed 30 times; missed 0 failed 0 times; total time spent 4672 ms; average time 155
DeleteDocumentAction executed 111 times; missed 2 failed 0 times; total time spent 32700 ms; average time 294
LoadDocumentAction executed 328 times; missed 0 failed 0 times; total time spent 248 ms; average time 0
AddDocumentLinkAction executed 129 times; missed 0 failed 0 times; total time spent 11780 ms; average time 91
EditDocumentAction executed 117 times; missed 0 failed 0 times; total time spent 17164 ms; average time 146
AddAssetAction executed 75 times; missed 0 failed 0 times; total time spent 11972 ms; average time 159
DeleteAssetAction executed 52 times; missed 0 failed 0 times; total time spent 2120 ms; average time 40
RenameAssetAction executed 35 times; missed 0 failed 0 times; total time spent 2008 ms; average time 57
DeleteFolderAction executed 55 times; missed 3 failed 0 times; total time spent 1476 ms; average time 26
RenameDocumentAction executed 119 times; missed 1 failed 0 times; total time spent 7048 ms; average time 59
MoveDocumentAction executed 135 times; missed 0 failed 0 times; total time spent 9808 ms; average time 72
Total actions run: 2644
Total successful actions: 2635
Total write actions run: 1220
Total missed actions: 9
Total failed actions: 0
Successrate: 1.0
Total time it took: 59.992 sec
Tests run: 1, Failures: 0, Errors: 0, Skipped: 0, Time elapsed: 82.004 sec - in org.hippoecm.repository.concurrent.StampedeTest
Running org.hippoecm.repository.updater.UpdaterTest
Tests run: 3, Failures: 0, Errors: 0, Skipped: 0, Time elapsed: 10.168 sec - in org.hippoecm.repository.updater.UpdaterTest
Running org.hippoecm.repository.sample.SampleRemoteWorkflowTest
Tests run: 2, Failures: 0, Errors: 0, Skipped: 0, Time elapsed: 12.312 sec - in org.hippoecm.repository.sample.SampleRemoteWorkflowTest
Running org.hippoecm.repository.facetnavigation.FacetedNavigationConcurrencyTest
Tests run: 4, Failures: 0, Errors: 0, Skipped: 0, Time elapsed: 59.976 sec - in org.hippoecm.repository.facetnavigation.FacetedNavigationConcurrencyTest
Running org.hippoecm.repository.TotalSizeTest
Tests run: 4, Failures: 0, Errors: 0, Skipped: 0, Time elapsed: 19.8 sec - in org.hippoecm.repository.TotalSizeTest
Running org.hippoecm.repository.test.RemoteTest
Tests run: 1, Failures: 0, Errors: 0, Skipped: 1, Time elapsed: 0.004 sec - in org.hippoecm.repository.test.RemoteTest
Running org.hippoecm.repository.test.WorkflowChainingTest
Tests run: 2, Failures: 0, Errors: 0, Skipped: 0, Time elapsed: 34.84 sec - in org.hippoecm.repository.test.WorkflowChainingTest
Running org.hippoecm.repository.decorating.MirrorTest
Tests run: 4, Failures: 0, Errors: 0, Skipped: 0, Time elapsed: 29.564 sec - in org.hippoecm.repository.decorating.MirrorTest
Running org.hippoecm.repository.quartz.SchedulerTest
Tests run: 5, Failures: 0, Errors: 1, Skipped: 0, Time elapsed: 174.956 sec <<< FAILURE! - in org.hippoecm.repository.quartz.SchedulerTest
testTriggerRepositoryJobNow(org.hippoecm.repository.quartz.SchedulerTest)  Time elapsed: 0.04 sec  <<< ERROR!
javax.jcr.RepositoryException: A job with name 'test' already exists in job group 'default'
	at org.hippoecm.repository.quartz.RepositorySchedulerImpl.newJobNode(RepositorySchedulerImpl.java:162)
	at org.hippoecm.repository.quartz.RepositorySchedulerImpl.createQuartzJobDetail(RepositorySchedulerImpl.java:148)
	at org.hippoecm.repository.quartz.RepositorySchedulerImpl.scheduleJob(RepositorySchedulerImpl.java:64)
	at sun.reflect.NativeMethodAccessorImpl.invoke0(Native Method)
	at sun.reflect.NativeMethodAccessorImpl.invoke(NativeMethodAccessorImpl.java:57)
	at sun.reflect.DelegatingMethodAccessorImpl.invoke(DelegatingMethodAccessorImpl.java:43)
	at java.lang.reflect.Method.invoke(Method.java:606)
	at org.onehippo.cms7.services.HippoServiceRegistry$NamedRegistration$1.invoke(HippoServiceRegistry.java:54)
	at com.sun.proxy.$Proxy17.scheduleJob(Unknown Source)
	at org.hippoecm.repository.quartz.SchedulerTest.testTriggerRepositoryJobNow(SchedulerTest.java:102)

Running org.onehippo.repository.update.UpdaterExecutorTest
Tests run: 3, Failures: 0, Errors: 0, Skipped: 0, Time elapsed: 24.668 sec - in org.onehippo.repository.update.UpdaterExecutorTest

Results :

Tests in error: 
  SchedulerTest.testTriggerRepositoryJobNow:102 ? Repository A job with name 'te...

Tests run: 29, Failures: 0, Errors: 1, Skipped: 1

[WARNING] File encoding has not been set, using platform encoding ANSI_X3.4-1968, i.e. build is platform dependent!
[INFO] 
[INFO] --- maven-failsafe-plugin:2.16:verify (default) @ hippo-repository-test ---
[INFO] Failsafe report directory: <https://integration.onehippo.com/job/Repository%20Integration%20Trunk/ws/test/target/failsafe-reports>
[WARNING] File encoding has not been set, using platform encoding ANSI_X3.4-1968, i.e. build is platform dependent!
[INFO] ------------------------------------------------------------------------
[INFO] Reactor Summary:
[INFO] 
[INFO] Repository ........................................ SUCCESS [3.148s]
[INFO] Repository API .................................... SUCCESS [5.492s]
[INFO] Repository Utilities .............................. SUCCESS [2.216s]
[INFO] Repository Connector .............................. SUCCESS [4.472s]
[INFO] Repository Provider Module Interface .............. SUCCESS [1.900s]
[INFO] Repository Test Utilities ......................... SUCCESS [3.812s]
[INFO] Repository Builtin workflow ....................... SUCCESS [0.984s]
[INFO] Repository Engine ................................. SUCCESS [2:10.712s]
[INFO] Repository Default Configuration .................. SUCCESS [21.608s]
[INFO] Repository Modules ................................ SUCCESS [26.024s]
[INFO] Repository Test Content ........................... SUCCESS [0.208s]
[INFO] Repository Deprecated ............................. SUCCESS [0.068s]
[INFO] Repository Deprecated Facetselect Mirror .......... SUCCESS [22.864s]
[INFO] Repository workflow implementations ............... SUCCESS [8:14.344s]
[INFO] Repository Deprecated Translation ................. SUCCESS [20.568s]
[INFO] Repository Deprecated Facetsearch ................. SUCCESS [31.060s]
[INFO] Repository Upgrade Module ......................... SUCCESS [11.440s]
[INFO] Repository Upgrade ................................ SUCCESS [0.080s]
[INFO] Repository Handle Migration ....................... SUCCESS [35.112s]
[INFO] Repository Upgrade XML Bootstrap Migration ........ SUCCESS [3.832s]
[INFO] Repository Test ................................... FAILURE [9:40.540s]
[INFO] Repository LDAP based Authorization ............... SKIPPED
[INFO] Repository Resources .............................. SKIPPED
[INFO] Repository Servlets ............................... SKIPPED
[INFO] Repository Dependencies ........................... SKIPPED
[INFO] ------------------------------------------------------------------------
[INFO] BUILD FAILURE
[INFO] ------------------------------------------------------------------------
[INFO] Total time: 23:23.772s
[INFO] Finished at: Thu Nov 21 10:09:28 CET 2013
[INFO] Final Memory: 21M/167M
[INFO] ------------------------------------------------------------------------
[INFO] o.h.m.e.h.MavenExecutionResultHandler - Build failed with exception(s)
[INFO] o.h.m.e.h.MavenExecutionResultHandler - [1] org.apache.maven.lifecycle.LifecycleExecutionException: Failed to execute goal org.apache.maven.plugins:maven-failsafe-plugin:2.16:verify (default) on project hippo-repository-test: There are test failures.

Please refer to <https://integration.onehippo.com/job/Repository%20Integration%20Trunk/ws/test/target/failsafe-reports> for the individual test results.
[DEBUG] Closing connection to remote
[ERROR] Failed to execute goal org.apache.maven.plugins:maven-failsafe-plugin:2.16:verify (default) on project hippo-repository-test: There are test failures.
[ERROR] 
[ERROR] Please refer to <https://integration.onehippo.com/job/Repository%20Integration%20Trunk/ws/test/target/failsafe-reports> for the individual test results.
[ERROR] -> [Help 1]
org.apache.maven.lifecycle.LifecycleExecutionException: Failed to execute goal org.apache.maven.plugins:maven-failsafe-plugin:2.16:verify (default) on project hippo-repository-test: There are test failures.

Please refer to <https://integration.onehippo.com/job/Repository%20Integration%20Trunk/ws/test/target/failsafe-reports> for the individual test results.
	at org.apache.maven.lifecycle.internal.MojoExecutor.execute(MojoExecutor.java:213)
	at org.apache.maven.lifecycle.internal.MojoExecutor.execute(MojoExecutor.java:153)
	at org.apache.maven.lifecycle.internal.MojoExecutor.execute(MojoExecutor.java:145)
	at org.apache.maven.lifecycle.internal.LifecycleModuleBuilder.buildProject(LifecycleModuleBuilder.java:84)
	at org.apache.maven.lifecycle.internal.LifecycleModuleBuilder.buildProject(LifecycleModuleBuilder.java:59)
	at org.apache.maven.lifecycle.internal.LifecycleStarter.singleThreadedBuild(LifecycleStarter.java:183)
	at org.apache.maven.lifecycle.internal.LifecycleStarter.execute(LifecycleStarter.java:161)
	at org.apache.maven.DefaultMaven.doExecute(DefaultMaven.java:319)
	at org.apache.maven.DefaultMaven.execute(DefaultMaven.java:156)
	at org.apache.maven.cli.MavenCli.execute(MavenCli.java:537)
	at org.apache.maven.cli.MavenCli.doMain(MavenCli.java:196)
	at org.apache.maven.cli.MavenCli.main(MavenCli.java:141)
	at sun.reflect.NativeMethodAccessorImpl.invoke0(Native Method)
	at sun.reflect.NativeMethodAccessorImpl.invoke(NativeMethodAccessorImpl.java:57)
	at sun.reflect.DelegatingMethodAccessorImpl.invoke(DelegatingMethodAccessorImpl.java:43)
	at java.lang.reflect.Method.invoke(Method.java:606)
	at org.codehaus.plexus.classworlds.launcher.Launcher.launchEnhanced(Launcher.java:290)
	at org.codehaus.plexus.classworlds.launcher.Launcher.launch(Launcher.java:230)
	at org.codehaus.plexus.classworlds.launcher.Launcher.mainWithExitCode(Launcher.java:409)
	at org.codehaus.plexus.classworlds.launcher.Launcher.main(Launcher.java:352)
Caused by: org.apache.maven.plugin.MojoFailureException: There are test failures.

Please refer to <https://integration.onehippo.com/job/Repository%20Integration%20Trunk/ws/test/target/failsafe-reports> for the individual test results.
	at org.apache.maven.plugin.surefire.SurefireHelper.reportExecution(SurefireHelper.java:82)
	at org.apache.maven.plugin.failsafe.VerifyMojo.execute(VerifyMojo.java:194)
	at org.apache.maven.plugin.DefaultBuildPluginManager.executeMojo(DefaultBuildPluginManager.java:101)
	at org.apache.maven.lifecycle.internal.MojoExecutor.execute(MojoExecutor.java:209)
	... 19 more
[ERROR] 
[ERROR] Re-run Maven using the -X switch to enable full debug logging.
[ERROR] 
[ERROR] For more information about the errors and possible solutions, please read the following articles:
[ERROR] [Help 1] http://cwiki.apache.org/confluence/display/MAVEN/MojoFailureException
[ERROR] 
[ERROR] After correcting the problems, you can resume the build with the command
[ERROR]   mvn <goals> -rf :hippo-repository-test
[DEBUG] Waiting for process to finish
[DEBUG] Result: 1
Recording test results

--
This message is automatically generated by Hudson. 
For more information on Hudson, see: http://hudson-ci.org/


More information about the Hippo-cms7-dev mailing list