[Hippo-cms7-dev] [Hudson] Build failed in Hudson: Repository Integration Trunk #659

Hippo Integration Hudson Server beheer at onehippo.com
Sun Sep 1 09:58:56 CEST 2013


See <https://integration.onehippo.com/job/Repository%20Integration%20Trunk/659/>

------------------------------------------
[...truncated 1265 lines...]
	at org.hippoecm.repository.impl.InitializationProcessorImpl.processInitializeItems(InitializationProcessorImpl.java:189)
	at org.hippoecm.repository.LocalHippoRepository.contentBootstrap(LocalHippoRepository.java:390)
	at org.hippoecm.repository.LocalHippoRepository.initializeStartup(LocalHippoRepository.java:299)
	at org.hippoecm.repository.LocalHippoRepository.initialize(LocalHippoRepository.java:226)
	at org.hippoecm.repository.LocalHippoRepository.create(LocalHippoRepository.java:127)
	at sun.reflect.NativeMethodAccessorImpl.invoke0(Native Method)
	at sun.reflect.NativeMethodAccessorImpl.invoke(NativeMethodAccessorImpl.java:57)
	at sun.reflect.DelegatingMethodAccessorImpl.invoke(DelegatingMethodAccessorImpl.java:43)
	at java.lang.reflect.Method.invoke(Method.java:601)
	at org.hippoecm.repository.HippoRepositoryFactory.getHippoRepository(HippoRepositoryFactory.java:74)
	at org.onehippo.repository.testutils.RepositoryTestCase.setUpClass(RepositoryTestCase.java:78)
	at sun.reflect.NativeMethodAccessorImpl.invoke0(Native Method)
	at sun.reflect.NativeMethodAccessorImpl.invoke(NativeMethodAccessorImpl.java:57)
	at sun.reflect.DelegatingMethodAccessorImpl.invoke(DelegatingMethodAccessorImpl.java:43)
	at java.lang.reflect.Method.invoke(Method.java:601)
	at org.junit.internal.runners.ClassRoadie.runBefores(ClassRoadie.java:49)
	at org.junit.internal.runners.ClassRoadie.runProtected(ClassRoadie.java:36)
	at org.junit.internal.runners.JUnit4ClassRunner.run(JUnit4ClassRunner.java:42)
	at org.apache.maven.surefire.junit4.JUnit4Provider.execute(JUnit4Provider.java:252)
	at org.apache.maven.surefire.junit4.JUnit4Provider.executeTestSet(JUnit4Provider.java:141)
	at org.apache.maven.surefire.junit4.JUnit4Provider.invoke(JUnit4Provider.java:112)
	at sun.reflect.NativeMethodAccessorImpl.invoke0(Native Method)
	at sun.reflect.NativeMethodAccessorImpl.invoke(NativeMethodAccessorImpl.java:57)
	at sun.reflect.DelegatingMethodAccessorImpl.invoke(DelegatingMethodAccessorImpl.java:43)
	at java.lang.reflect.Method.invoke(Method.java:601)
	at org.apache.maven.surefire.util.ReflectionUtils.invokeMethodWithArray(ReflectionUtils.java:189)
	at org.apache.maven.surefire.booter.ProviderFactory$ProviderProxy.invoke(ProviderFactory.java:165)
	at org.apache.maven.surefire.booter.ProviderFactory.invokeProvider(ProviderFactory.java:85)
	at org.apache.maven.surefire.booter.ForkedBooter.runSuitesInProcess(ForkedBooter.java:115)
	at org.apache.maven.surefire.booter.ForkedBooter.main(ForkedBooter.java:75)
01.09.2013 09:51:26 ERROR [org.hippoecm.repository.impl.InitializationProcessorImpl.initializeNodecontent():956] Error initializing content for types/testcontent-type-news.xml in '/hippo:namespaces/testcontent' : javax.jcr.InvalidSerializedDataException: illegal property name: hippostdpubwf:createdBy
01.09.2013 09:51:26 ERROR [org.hippoecm.repository.impl.InitializationProcessorImpl.initializeNodecontent():956] Error initializing content for testcontent-data.xml in '/' : javax.jcr.InvalidSerializedDataException: illegal property name: hippostdpubwf:createdBy
01.09.2013 09:51:26 ERROR [org.hippoecm.repository.impl.InitializationProcessorImpl.initializeNodecontent():956] Error initializing content for testcontent-image-example.xml in '/content/gallery' : javax.jcr.InvalidSerializedDataException: illegal node type name: hippogallery:stdImageGallery
01.09.2013 09:51:26 ERROR [org.hippoecm.repository.impl.InitializationProcessorImpl.initializeNodecontent():956] Error initializing content for testcontent-asset-example.xml in '/content/assets' : javax.jcr.InvalidSerializedDataException: illegal node type name: hippogallery:stdAssetGallery
01.09.2013 09:51:26 WARN  [org.apache.jackrabbit.core.state.ItemStateReferenceCache.cache():178] overwriting cached entry cafebabe-cafe-babe-cafe-babecafebabe
01.09.2013 09:51:26 WARN  [org.apache.jackrabbit.core.state.ItemStateReferenceCache.cache():178] overwriting cached entry cafebabe-cafe-babe-cafe-babecafebabe
01.09.2013 09:51:26 WARN  [org.apache.jackrabbit.core.state.ItemStateReferenceCache.cache():178] overwriting cached entry cafebabe-cafe-babe-cafe-babecafebabe
01.09.2013 09:51:26 WARN  [org.apache.jackrabbit.core.state.ItemStateReferenceCache.cache():178] overwriting cached entry cafebabe-cafe-babe-cafe-babecafebabe
01.09.2013 09:51:26 WARN  [org.apache.jackrabbit.core.state.ItemStateReferenceCache.cache():178] overwriting cached entry cafebabe-cafe-babe-cafe-babecafebabe
01.09.2013 09:51:26 WARN  [org.apache.jackrabbit.core.state.ItemStateReferenceCache.cache():178] overwriting cached entry cafebabe-cafe-babe-cafe-babecafebabe
01.09.2013 09:51:26 WARN  [org.apache.jackrabbit.core.state.ItemStateReferenceCache.cache():178] overwriting cached entry cafebabe-cafe-babe-cafe-babecafebabe
01.09.2013 09:51:26 WARN  [org.apache.jackrabbit.core.state.ItemStateReferenceCache.cache():178] overwriting cached entry cafebabe-cafe-babe-cafe-babecafebabe
01.09.2013 09:51:26 WARN  [org.apache.jackrabbit.core.state.ItemStateReferenceCache.cache():178] overwriting cached entry cafebabe-cafe-babe-cafe-babecafebabe
01.09.2013 09:51:26 WARN  [org.apache.jackrabbit.core.ItemManager.getDefinition():225] Fallback to nt:unstructured due to unknown child node definition for type '{internal}root'
01.09.2013 09:51:26 WARN  [org.apache.jackrabbit.core.ItemManager.getDefinition():225] Fallback to nt:unstructured due to unknown child node definition for type '{internal}root'
01.09.2013 09:51:26 WARN  [org.apache.jackrabbit.core.ItemManager.getDefinition():225] Fallback to nt:unstructured due to unknown child node definition for type '{internal}root'
01.09.2013 09:51:26 WARN  [org.apache.jackrabbit.core.ItemManager.getDefinition():225] Fallback to nt:unstructured due to unknown child node definition for type '{internal}root'
01.09.2013 09:51:26 WARN  [org.hippoecm.repository.jackrabbit.MirrorVirtualProvider.populate():218] Mirror of facetselect is not allowed to have as docbase the uuid of another mirror or facetselect.
01.09.2013 09:51:26 WARN  [org.apache.jackrabbit.core.state.ItemStateReferenceCache.cache():178] overwriting cached entry cafebabe-cafe-babe-cafe-babecafebabe
01.09.2013 09:51:26 WARN  [org.apache.jackrabbit.core.state.ItemStateReferenceCache.cache():178] overwriting cached entry cafebabe-cafe-babe-cafe-babecafebabe
01.09.2013 09:51:26 WARN  [org.apache.jackrabbit.core.state.ItemStateReferenceCache.cache():178] overwriting cached entry cafebabe-cafe-babe-cafe-babecafebabe
01.09.2013 09:51:26 WARN  [org.apache.jackrabbit.core.state.ItemStateReferenceCache.cache():178] overwriting cached entry cafebabe-cafe-babe-cafe-babecafebabe
01.09.2013 09:51:26 WARN  [org.apache.jackrabbit.core.state.ItemStateReferenceCache.cache():178] overwriting cached entry cafebabe-cafe-babe-cafe-babecafebabe
01.09.2013 09:51:26 WARN  [org.apache.jackrabbit.core.state.ItemStateReferenceCache.cache():178] overwriting cached entry cafebabe-cafe-babe-cafe-babecafebabe
01.09.2013 09:51:26 WARN  [org.apache.jackrabbit.core.state.ItemStateReferenceCache.cache():178] overwriting cached entry cafebabe-cafe-babe-cafe-babecafebabe
01.09.2013 09:51:26 WARN  [org.apache.jackrabbit.core.ItemManager.getDefinition():225] Fallback to nt:unstructured due to unknown child node definition for type '{internal}root'
01.09.2013 09:51:27 WARN  [org.apache.jackrabbit.core.state.ItemStateReferenceCache.cache():178] overwriting cached entry cafebabe-cafe-babe-cafe-babecafebabe
Tests run: 12, Failures: 0, Errors: 0, Skipped: 0, Time elapsed: 10.204 sec

Results :

Tests run: 18, Failures: 0, Errors: 0, Skipped: 1

[INFO] 
[INFO] --- maven-jar-plugin:2.4:jar (default-jar) @ hippo-repository-deprecated-facetselectmirror ---
[INFO] Building jar: <https://integration.onehippo.com/job/Repository%20Integration%20Trunk/ws/deprecated/facetselectmirror/target/hippo-repository-deprecated-facetselectmirror-2.25.04-SNAPSHOT.jar>
[INFO] 
[INFO] --- maven-source-plugin:2.2.1:jar-no-fork (attach-sources) @ hippo-repository-deprecated-facetselectmirror ---
[INFO] Building jar: <https://integration.onehippo.com/job/Repository%20Integration%20Trunk/ws/deprecated/facetselectmirror/target/hippo-repository-deprecated-facetselectmirror-2.25.04-SNAPSHOT-sources.jar>
[INFO]                                                                         
[INFO] ------------------------------------------------------------------------
[INFO] Building Repository workflow implementations 2.25.04-SNAPSHOT
[INFO] ------------------------------------------------------------------------
[INFO] 
[INFO] --- maven-clean-plugin:2.4.1:clean (default-clean) @ hippo-repository-workflow ---
[INFO] Deleting <https://integration.onehippo.com/job/Repository%20Integration%20Trunk/ws/workflow/target>
[INFO] 
[INFO] --- maven-remote-resources-plugin:1.4:process (default) @ hippo-repository-workflow ---
[INFO] 
[INFO] --- maven-resources-plugin:2.6:resources (default-resources) @ hippo-repository-workflow ---
[INFO] Using 'UTF-8' encoding to copy filtered resources.
[INFO] Copying 16 resources
[INFO] Copying 3 resources
[INFO] 
[INFO] --- maven-compiler-plugin:2.5.1:compile (default-compile) @ hippo-repository-workflow ---
[INFO] Compiling 13 source files to <https://integration.onehippo.com/job/Repository%20Integration%20Trunk/ws/workflow/target/classes>
[INFO] 
[INFO] --- maven-resources-plugin:2.6:testResources (default-testResources) @ hippo-repository-workflow ---
[INFO] Using 'UTF-8' encoding to copy filtered resources.
[INFO] Copying 10 resources
[INFO] Copying 3 resources
[INFO] 
[INFO] --- maven-compiler-plugin:2.5.1:testCompile (default-testCompile) @ hippo-repository-workflow ---
[INFO] Compiling 9 source files to <https://integration.onehippo.com/job/Repository%20Integration%20Trunk/ws/workflow/target/test-classes>
[INFO] 
[INFO] --- maven-surefire-plugin:2.12.4:test (default-test) @ hippo-repository-workflow ---
[INFO] Surefire report directory: <https://integration.onehippo.com/job/Repository%20Integration%20Trunk/ws/workflow/target/surefire-reports>

-------------------------------------------------------
 T E S T S
-------------------------------------------------------

-------------------------------------------------------
 T E S T S
-------------------------------------------------------
Running org.hippoecm.repository.CopyTest
Tests run: 10, Failures: 0, Errors: 0, Skipped: 0, Time elapsed: 16.304 sec
Running org.hippoecm.repository.reviewedactions.ReviewedActionsWorkflowTest
Tests run: 5, Failures: 0, Errors: 0, Skipped: 0, Time elapsed: 15.404 sec
Running org.hippoecm.repository.reviewedactions.VersioningWorkflowTest
Tests run: 1, Failures: 0, Errors: 0, Skipped: 0, Time elapsed: 16.596 sec
Running org.hippoecm.repository.reviewedactions.FailingWorkflowTest
Tests run: 1, Failures: 0, Errors: 0, Skipped: 0, Time elapsed: 16.552 sec
Running org.hippoecm.repository.reviewedactions.WorkflowAuthorizationTest
Tests run: 2, Failures: 0, Errors: 0, Skipped: 0, Time elapsed: 16.056 sec
Running org.hippoecm.faceteddate.DerivedDateTest
Tests run: 3, Failures: 0, Errors: 0, Skipped: 0, Time elapsed: 15.964 sec

Results :

Tests run: 22, Failures: 0, Errors: 0, Skipped: 0

[INFO] 
[INFO] --- maven-jar-plugin:2.4:jar (default-jar) @ hippo-repository-workflow ---
[INFO] Building jar: <https://integration.onehippo.com/job/Repository%20Integration%20Trunk/ws/workflow/target/hippo-repository-workflow-2.25.04-SNAPSHOT.jar>
[INFO] 
[INFO] --- maven-source-plugin:2.2.1:jar-no-fork (attach-sources) @ hippo-repository-workflow ---
[INFO] Building jar: <https://integration.onehippo.com/job/Repository%20Integration%20Trunk/ws/workflow/target/hippo-repository-workflow-2.25.04-SNAPSHOT-sources.jar>
[INFO] 
[INFO] --- maven-failsafe-plugin:2.16:integration-test (integration-test) @ hippo-repository-workflow ---
[INFO] Failsafe report directory: <https://integration.onehippo.com/job/Repository%20Integration%20Trunk/ws/workflow/target/failsafe-reports>

-------------------------------------------------------
 T E S T S
-------------------------------------------------------
Running org.hippoecm.repository.reviewedactions.AcceptRequestTest
Tests run: 2, Failures: 0, Errors: 0, Skipped: 0, Time elapsed: 331.324 sec - in org.hippoecm.repository.reviewedactions.AcceptRequestTest
Running org.hippoecm.repository.translation.TranslationWorkflowTest
Tests run: 4, Failures: 2, Errors: 0, Skipped: 0, Time elapsed: 11.116 sec <<< FAILURE! - in org.hippoecm.repository.translation.TranslationWorkflowTest
testTranslateDocumentInTranslatedFolder(org.hippoecm.repository.translation.TranslationWorkflowTest)  Time elapsed: 0.184 sec  <<< FAILURE!
java.lang.AssertionError: 
	at org.junit.Assert.fail(Assert.java:74)
	at org.junit.Assert.assertTrue(Assert.java:37)
	at org.junit.Assert.assertTrue(Assert.java:46)
	at org.hippoecm.repository.translation.TranslationWorkflowTest.testTranslateDocumentInTranslatedFolder(TranslationWorkflowTest.java:131)

testTranslateFolder(org.hippoecm.repository.translation.TranslationWorkflowTest)  Time elapsed: 0.1 sec  <<< FAILURE!
java.lang.AssertionError: 
	at org.junit.Assert.fail(Assert.java:74)
	at org.junit.Assert.assertTrue(Assert.java:37)
	at org.junit.Assert.assertTrue(Assert.java:46)
	at org.hippoecm.repository.translation.TranslationWorkflowTest.testTranslateFolder(TranslationWorkflowTest.java:149)


Results :

Failed tests: 
  TranslationWorkflowTest.testTranslateDocumentInTranslatedFolder:131 
  TranslationWorkflowTest.testTranslateFolder:149 

Tests run: 6, Failures: 2, Errors: 0, Skipped: 0

[WARNING] File encoding has not been set, using platform encoding ANSI_X3.4-1968, i.e. build is platform dependent!
[INFO] 
[INFO] --- maven-failsafe-plugin:2.16:verify (integration-test) @ hippo-repository-workflow ---
[INFO] Failsafe report directory: <https://integration.onehippo.com/job/Repository%20Integration%20Trunk/ws/workflow/target/failsafe-reports>
[WARNING] File encoding has not been set, using platform encoding ANSI_X3.4-1968, i.e. build is platform dependent!
[INFO] ------------------------------------------------------------------------
[INFO] Reactor Summary:
[INFO] 
[INFO] Repository ........................................ SUCCESS [2.180s]
[INFO] Repository API .................................... SUCCESS [5.032s]
[INFO] Repository Utilities .............................. SUCCESS [1.740s]
[INFO] Repository Connector .............................. SUCCESS [3.944s]
[INFO] Repository Provider Module Interface .............. SUCCESS [1.472s]
[INFO] Repository Test Utilities ......................... SUCCESS [2.980s]
[INFO] Repository Builtin workflow ....................... SUCCESS [1.028s]
[INFO] Repository Engine ................................. SUCCESS [3:33.772s]
[INFO] Repository Default Configuration .................. SUCCESS [22.312s]
[INFO] Repository Modules ................................ SUCCESS [25.748s]
[INFO] Repository Deprecated ............................. SUCCESS [0.060s]
[INFO] Repository Deprecated Translation ................. SUCCESS [0.992s]
[INFO] Repository Test Content ........................... SUCCESS [0.192s]
[INFO] Repository Deprecated Facetselect Mirror .......... SUCCESS [39.476s]
[INFO] Repository workflow implementations ............... FAILURE [7:24.480s]
[INFO] Repository Deprecated Facetsearch ................. SKIPPED
[INFO] Repository Upgrade Module ......................... SKIPPED
[INFO] Repository Test ................................... SKIPPED
[INFO] Repository LDAP based Authorization ............... SKIPPED
[INFO] Repository Resources .............................. SKIPPED
[INFO] Repository Servlets ............................... SKIPPED
[INFO] Repository Dependencies ........................... SKIPPED
[INFO] ------------------------------------------------------------------------
[INFO] BUILD FAILURE
[INFO] ------------------------------------------------------------------------
[INFO] Total time: 12:47.652s
[INFO] Finished at: Sun Sep 01 09:58:56 CEST 2013
[INFO] Final Memory: 17M/41M
[INFO] ------------------------------------------------------------------------
[INFO] o.h.m.e.h.MavenExecutionResultHandler - Build failed with exception(s)
[INFO] o.h.m.e.h.MavenExecutionResultHandler - [1] org.apache.maven.lifecycle.LifecycleExecutionException: Failed to execute goal org.apache.maven.plugins:maven-failsafe-plugin:2.16:verify (integration-test) on project hippo-repository-workflow: There are test failures.

Please refer to <https://integration.onehippo.com/job/Repository%20Integration%20Trunk/ws/workflow/target/failsafe-reports> for the individual test results.
[DEBUG] Closing connection to remote
[ERROR] Failed to execute goal org.apache.maven.plugins:maven-failsafe-plugin:2.16:verify (integration-test) on project hippo-repository-workflow: There are test failures.
[ERROR] 
[ERROR] Please refer to <https://integration.onehippo.com/job/Repository%20Integration%20Trunk/ws/workflow/target/failsafe-reports> for the individual test results.
[ERROR] -> [Help 1]
org.apache.maven.lifecycle.LifecycleExecutionException: Failed to execute goal org.apache.maven.plugins:maven-failsafe-plugin:2.16:verify (integration-test) on project hippo-repository-workflow: There are test failures.

Please refer to <https://integration.onehippo.com/job/Repository%20Integration%20Trunk/ws/workflow/target/failsafe-reports> for the individual test results.
	at org.apache.maven.lifecycle.internal.MojoExecutor.execute(MojoExecutor.java:213)
	at org.apache.maven.lifecycle.internal.MojoExecutor.execute(MojoExecutor.java:153)
	at org.apache.maven.lifecycle.internal.MojoExecutor.execute(MojoExecutor.java:145)
	at org.apache.maven.lifecycle.internal.LifecycleModuleBuilder.buildProject(LifecycleModuleBuilder.java:84)
	at org.apache.maven.lifecycle.internal.LifecycleModuleBuilder.buildProject(LifecycleModuleBuilder.java:59)
	at org.apache.maven.lifecycle.internal.LifecycleStarter.singleThreadedBuild(LifecycleStarter.java:183)
	at org.apache.maven.lifecycle.internal.LifecycleStarter.execute(LifecycleStarter.java:161)
	at org.apache.maven.DefaultMaven.doExecute(DefaultMaven.java:319)
	at org.apache.maven.DefaultMaven.execute(DefaultMaven.java:156)
	at org.apache.maven.cli.MavenCli.execute(MavenCli.java:537)
	at org.apache.maven.cli.MavenCli.doMain(MavenCli.java:196)
	at org.apache.maven.cli.MavenCli.main(MavenCli.java:141)
	at sun.reflect.NativeMethodAccessorImpl.invoke0(Native Method)
	at sun.reflect.NativeMethodAccessorImpl.invoke(NativeMethodAccessorImpl.java:57)
	at sun.reflect.DelegatingMethodAccessorImpl.invoke(DelegatingMethodAccessorImpl.java:43)
	at java.lang.reflect.Method.invoke(Method.java:601)
	at org.codehaus.plexus.classworlds.launcher.Launcher.launchEnhanced(Launcher.java:290)
	at org.codehaus.plexus.classworlds.launcher.Launcher.launch(Launcher.java:230)
	at org.codehaus.plexus.classworlds.launcher.Launcher.mainWithExitCode(Launcher.java:409)
	at org.codehaus.plexus.classworlds.launcher.Launcher.main(Launcher.java:352)
Caused by: org.apache.maven.plugin.MojoFailureException: There are test failures.

Please refer to <https://integration.onehippo.com/job/Repository%20Integration%20Trunk/ws/workflow/target/failsafe-reports> for the individual test results.
	at org.apache.maven.plugin.surefire.SurefireHelper.reportExecution(SurefireHelper.java:82)
	at org.apache.maven.plugin.failsafe.VerifyMojo.execute(VerifyMojo.java:194)
	at org.apache.maven.plugin.DefaultBuildPluginManager.executeMojo(DefaultBuildPluginManager.java:101)
	at org.apache.maven.lifecycle.internal.MojoExecutor.execute(MojoExecutor.java:209)
	... 19 more
[ERROR] 
[ERROR] Re-run Maven using the -X switch to enable full debug logging.
[ERROR] 
[ERROR] For more information about the errors and possible solutions, please read the following articles:
[ERROR] [Help 1] http://cwiki.apache.org/confluence/display/MAVEN/MojoFailureException
[ERROR] 
[ERROR] After correcting the problems, you can resume the build with the command
[ERROR]   mvn <goals> -rf :hippo-repository-workflow
[DEBUG] Waiting for process to finish
[DEBUG] Result: 1

--
This message is automatically generated by Hudson. 
For more information on Hudson, see: http://hudson-ci.org/


More information about the Hippo-cms7-dev mailing list