[Hippo-cms7-dev] [Hudson] Build failed in Hudson: Repository Integration Trunk #662

Hippo Integration Hudson Server beheer at onehippo.com
Mon Sep 2 12:59:07 CEST 2013


See <https://integration.onehippo.com/job/Repository%20Integration%20Trunk/662/>

------------------------------------------
[...truncated 362 lines...]
Tests run: 1, Failures: 0, Errors: 0, Skipped: 0, Time elapsed: 2.624 sec
Running org.hippoecm.repository.impl.WorkflowPostActionsTest
Tests run: 2, Failures: 0, Errors: 0, Skipped: 0, Time elapsed: 0.168 sec
Running org.hippoecm.repository.ImpersonateTest
Tests run: 4, Failures: 0, Errors: 0, Skipped: 0, Time elapsed: 2.556 sec
Running org.hippoecm.repository.ExportCndTest
Tests run: 2, Failures: 0, Errors: 0, Skipped: 0, Time elapsed: 2.552 sec
Running org.hippoecm.repository.PdfExtractedTextWithLineBreaksAreIndexedCorrectlyTest
Tests run: 3, Failures: 0, Errors: 0, Skipped: 0, Time elapsed: 3.28 sec
Running org.hippoecm.repository.HREPTWO3402IssueTest
Tests run: 1, Failures: 0, Errors: 0, Skipped: 0, Time elapsed: 2.3 sec
Running org.hippoecm.repository.HippoNodeTypeSanityTest
Tests run: 1, Failures: 0, Errors: 0, Skipped: 0, Time elapsed: 2.224 sec
Running org.hippoecm.repository.query.lucene.caching.FacetedEngineCacheTest
Tests run: 2, Failures: 0, Errors: 0, Skipped: 0, Time elapsed: 0.036 sec
Running org.hippoecm.repository.query.lucene.util.MultiDocIdSetTest
Tests run: 1, Failures: 0, Errors: 0, Skipped: 0, Time elapsed: 0.004 sec
Running org.hippoecm.repository.query.lucene.util.SetDocIdSetBuilderTest
cardinality: 27, pure bitset time: 520
Tests run: 1, Failures: 0, Errors: 0, Skipped: 0, Time elapsed: 49.868 sec
Running org.hippoecm.repository.RepositoryMapTest
Tests run: 2, Failures: 0, Errors: 0, Skipped: 0, Time elapsed: 2.336 sec
Running org.hippoecm.repository.SecurityServiceTest
Tests run: 8, Failures: 1, Errors: 0, Skipped: 0, Time elapsed: 2.236 sec <<< FAILURE!
testListGroups(org.hippoecm.repository.SecurityServiceTest)  Time elapsed: 0.016 sec  <<< FAILURE!
junit.framework.ComparisonFailure: null expected:<[admin]> but was:<[_x0027_t hart]>
	at junit.framework.Assert.assertEquals(Assert.java:81)
	at junit.framework.Assert.assertEquals(Assert.java:87)
	at org.hippoecm.repository.SecurityServiceTest.testListGroups(SecurityServiceTest.java:90)
	at sun.reflect.NativeMethodAccessorImpl.invoke0(Native Method)
	at sun.reflect.NativeMethodAccessorImpl.invoke(NativeMethodAccessorImpl.java:57)
	at sun.reflect.DelegatingMethodAccessorImpl.invoke(DelegatingMethodAccessorImpl.java:43)
	at java.lang.reflect.Method.invoke(Method.java:601)
	at org.junit.internal.runners.TestMethod.invoke(TestMethod.java:59)
	at org.junit.internal.runners.MethodRoadie.runTestMethod(MethodRoadie.java:98)
	at org.junit.internal.runners.MethodRoadie$2.run(MethodRoadie.java:79)
	at org.junit.internal.runners.MethodRoadie.runBeforesThenTestThenAfters(MethodRoadie.java:87)
	at org.junit.internal.runners.MethodRoadie.runTest(MethodRoadie.java:77)
	at org.junit.internal.runners.MethodRoadie.run(MethodRoadie.java:42)
	at org.junit.internal.runners.JUnit4ClassRunner.invokeTestMethod(JUnit4ClassRunner.java:88)
	at org.junit.internal.runners.JUnit4ClassRunner.runMethods(JUnit4ClassRunner.java:51)
	at org.junit.internal.runners.JUnit4ClassRunner$1.run(JUnit4ClassRunner.java:44)
	at org.junit.internal.runners.ClassRoadie.runUnprotected(ClassRoadie.java:27)
	at org.junit.internal.runners.ClassRoadie.runProtected(ClassRoadie.java:37)
	at org.junit.internal.runners.JUnit4ClassRunner.run(JUnit4ClassRunner.java:42)
	at org.apache.maven.surefire.junit4.JUnit4Provider.execute(JUnit4Provider.java:252)
	at org.apache.maven.surefire.junit4.JUnit4Provider.executeTestSet(JUnit4Provider.java:141)
	at org.apache.maven.surefire.junit4.JUnit4Provider.invoke(JUnit4Provider.java:112)
	at sun.reflect.NativeMethodAccessorImpl.invoke0(Native Method)
	at sun.reflect.NativeMethodAccessorImpl.invoke(NativeMethodAccessorImpl.java:57)
	at sun.reflect.DelegatingMethodAccessorImpl.invoke(DelegatingMethodAccessorImpl.java:43)
	at java.lang.reflect.Method.invoke(Method.java:601)
	at org.apache.maven.surefire.util.ReflectionUtils.invokeMethodWithArray(ReflectionUtils.java:189)
	at org.apache.maven.surefire.booter.ProviderFactory$ProviderProxy.invoke(ProviderFactory.java:165)
	at org.apache.maven.surefire.booter.ProviderFactory.invokeProvider(ProviderFactory.java:85)
	at org.apache.maven.surefire.booter.ForkedBooter.runSuitesInProcess(ForkedBooter.java:115)
	at org.apache.maven.surefire.booter.ForkedBooter.main(ForkedBooter.java:75)

Running org.hippoecm.repository.OrderByNodeNameTest
Tests run: 6, Failures: 0, Errors: 0, Skipped: 0, Time elapsed: 2.34 sec
Running org.hippoecm.repository.StandardHippoAnalyzerTest
Tests run: 2, Failures: 0, Errors: 0, Skipped: 0, Time elapsed: 2.096 sec
Running org.hippoecm.repository.NodeNameCodecTest
Tests run: 4, Failures: 0, Errors: 0, Skipped: 0, Time elapsed: 2.236 sec
Running org.hippoecm.repository.DescriptorsTest
Tests run: 2, Failures: 0, Errors: 0, Skipped: 0, Time elapsed: 2.16 sec
Running org.hippoecm.repository.ConcurrentModificationTest
Tests run: 14, Failures: 0, Errors: 0, Skipped: 0, Time elapsed: 2.624 sec
Running org.hippoecm.repository.PendingChangesTest
Tests run: 2, Failures: 0, Errors: 0, Skipped: 0, Time elapsed: 2.216 sec
Running org.hippoecm.repository.quartz.JCRJobStoreTest
Tests run: 8, Failures: 0, Errors: 0, Skipped: 0, Time elapsed: 14.432 sec
Running org.hippoecm.repository.AuthorizationSanityTest
Tests run: 1, Failures: 0, Errors: 0, Skipped: 0, Time elapsed: 2.2 sec
Running org.hippoecm.repository.DocumentViewExportTest
Tests run: 1, Failures: 0, Errors: 0, Skipped: 0, Time elapsed: 2.096 sec
Running org.hippoecm.repository.SearchDateRangeTest
02.09.2013 12:58:36 ERROR [org.hippoecm.repository.quartz.JCRJobStore.refreshLock():502] Failed to refresh lock
javax.jcr.RepositoryException: This session has been closed. See the chained exception for a trace of where the session was closed.
	at org.apache.jackrabbit.core.session.SessionState.checkAlive(SessionState.java:150)
	at org.apache.jackrabbit.core.SessionImpl.sanityCheck(SessionImpl.java:376)
	at org.apache.jackrabbit.core.SessionImpl.getNodeById(SessionImpl.java:537)
	at org.apache.jackrabbit.core.SessionImpl.getNodeByIdentifier(SessionImpl.java:1106)
	at org.hippoecm.repository.decorating.SessionDecorator.getNodeByIdentifier(SessionDecorator.java:348)
	at org.hippoecm.repository.quartz.JCRJobStore.refreshLock(JCRJobStore.java:496)
	at org.hippoecm.repository.quartz.JCRJobStore.access$000(JCRJobStore.java:75)
	at org.hippoecm.repository.quartz.JCRJobStore$1.run(JCRJobStore.java:512)
	at java.util.concurrent.Executors$RunnableAdapter.call(Executors.java:471)
	at java.util.concurrent.FutureTask$Sync.innerRunAndReset(FutureTask.java:351)
	at java.util.concurrent.FutureTask.runAndReset(FutureTask.java:178)
	at java.util.concurrent.ScheduledThreadPoolExecutor$ScheduledFutureTask.access$301(ScheduledThreadPoolExecutor.java:178)
	at java.util.concurrent.ScheduledThreadPoolExecutor$ScheduledFutureTask.run(ScheduledThreadPoolExecutor.java:293)
	at java.util.concurrent.ThreadPoolExecutor.runWorker(ThreadPoolExecutor.java:1110)
	at java.util.concurrent.ThreadPoolExecutor$Worker.run(ThreadPoolExecutor.java:603)
	at java.lang.Thread.run(Thread.java:722)
Caused by: java.lang.Exception: Stack trace of  where session-186 was originally closed
	at org.apache.jackrabbit.core.session.SessionState.close(SessionState.java:275)
	at org.apache.jackrabbit.core.SessionImpl.logout(SessionImpl.java:947)
	at org.apache.jackrabbit.core.XASessionImpl.logout(XASessionImpl.java:397)
	at org.hippoecm.repository.jackrabbit.XASessionImpl.logout(XASessionImpl.java:163)
	at org.hippoecm.repository.decorating.SessionDecorator.logout(SessionDecorator.java:292)
	at org.onehippo.repository.testutils.RepositoryTestCase.tearDown(RepositoryTestCase.java:144)
	at org.onehippo.repository.testutils.RepositoryTestCase.tearDown(RepositoryTestCase.java:134)
	at sun.reflect.GeneratedMethodAccessor7.invoke(Unknown Source)
	at sun.reflect.DelegatingMethodAccessorImpl.invoke(DelegatingMethodAccessorImpl.java:43)
	at java.lang.reflect.Method.invoke(Method.java:601)
	at org.junit.internal.runners.MethodRoadie.runAfters(MethodRoadie.java:138)
	at org.junit.internal.runners.MethodRoadie.runBeforesThenTestThenAfters(MethodRoadie.java:92)
	at org.junit.internal.runners.MethodRoadie.runTest(MethodRoadie.java:77)
	at org.junit.internal.runners.MethodRoadie.run(MethodRoadie.java:42)
	at org.junit.internal.runners.JUnit4ClassRunner.invokeTestMethod(JUnit4ClassRunner.java:88)
	at org.junit.internal.runners.JUnit4ClassRunner.runMethods(JUnit4ClassRunner.java:51)
	at org.junit.internal.runners.JUnit4ClassRunner$1.run(JUnit4ClassRunner.java:44)
	at org.junit.internal.runners.ClassRoadie.runUnprotected(ClassRoadie.java:27)
	at org.junit.internal.runners.ClassRoadie.runProtected(ClassRoadie.java:37)
	at org.junit.internal.runners.JUnit4ClassRunner.run(JUnit4ClassRunner.java:42)
	at org.apache.maven.surefire.junit4.JUnit4Provider.execute(JUnit4Provider.java:252)
	at org.apache.maven.surefire.junit4.JUnit4Provider.executeTestSet(JUnit4Provider.java:141)
	at org.apache.maven.surefire.junit4.JUnit4Provider.invoke(JUnit4Provider.java:112)
	at sun.reflect.NativeMethodAccessorImpl.invoke0(Native Method)
	at sun.reflect.NativeMethodAccessorImpl.invoke(NativeMethodAccessorImpl.java:57)
	at sun.reflect.DelegatingMethodAccessorImpl.invoke(DelegatingMethodAccessorImpl.java:43)
	at java.lang.reflect.Method.invoke(Method.java:601)
	at org.apache.maven.surefire.util.ReflectionUtils.invokeMethodWithArray(ReflectionUtils.java:189)
	at org.apache.maven.surefire.booter.ProviderFactory$ProviderProxy.invoke(ProviderFactory.java:165)
	at org.apache.maven.surefire.booter.ProviderFactory.invokeProvider(ProviderFactory.java:85)
	at org.apache.maven.surefire.booter.ForkedBooter.runSuitesInProcess(ForkedBooter.java:115)
	at org.apache.maven.surefire.booter.ForkedBooter.main(ForkedBooter.java:75)
Tests run: 5, Failures: 0, Errors: 0, Skipped: 0, Time elapsed: 46.952 sec
Running org.hippoecm.repository.SearchOnNodeNameTest
Tests run: 4, Failures: 0, Errors: 0, Skipped: 0, Time elapsed: 2.08 sec
Running org.hippoecm.repository.FreeTextSearchTest
Tests run: 10, Failures: 0, Errors: 0, Skipped: 0, Time elapsed: 5.372 sec
Running org.hippoecm.repository.PdfExtractionAndIndexingTest
Tests run: 2, Failures: 0, Errors: 0, Skipped: 0, Time elapsed: 2.14 sec
Running org.hippoecm.repository.DerivedDataTest
Tests run: 3, Failures: 0, Errors: 0, Skipped: 0, Time elapsed: 2.084 sec
Running org.hippoecm.repository.BoilerPlateTest
Tests run: 1, Failures: 0, Errors: 0, Skipped: 0, Time elapsed: 1.964 sec
Running org.hippoecm.repository.DereferencedExportImportTest
Tests run: 9, Failures: 0, Errors: 0, Skipped: 0, Time elapsed: 2.396 sec
Running org.hippoecm.repository.HippoQueryTest
Tests run: 1, Failures: 0, Errors: 0, Skipped: 0, Time elapsed: 2.124 sec
Running org.hippoecm.repository.RepositoryLoginTest
Tests run: 15, Failures: 0, Errors: 0, Skipped: 0, Time elapsed: 2.896 sec
Running org.hippoecm.repository.TrivialServerTest
Tests run: 3, Failures: 0, Errors: 0, Skipped: 0, Time elapsed: 2.1 sec
Running org.hippoecm.repository.HREPTWO1104Test
Tests run: 1, Failures: 0, Errors: 0, Skipped: 0, Time elapsed: 2.004 sec
Running org.hippoecm.repository.RefreshTest
Tests run: 2, Failures: 0, Errors: 0, Skipped: 0, Time elapsed: 2.08 sec
Running org.hippoecm.repository.decorating.PathsTest
Tests run: 2, Failures: 0, Errors: 0, Skipped: 0, Time elapsed: 0.04 sec
Running org.onehippo.repository.modules.ModuleRegistryTest
Tests run: 2, Failures: 0, Errors: 0, Skipped: 0, Time elapsed: 0.004 sec
Running org.onehippo.repository.update.GroovyUpdaterClassLoaderTest
Tests run: 5, Failures: 0, Errors: 0, Skipped: 0, Time elapsed: 0.352 sec

Results :

Failed tests:   testListGroups(org.hippoecm.repository.SecurityServiceTest): null expected:<[admin]> but was:<[_x0027_t hart]>

Tests run: 148, Failures: 1, Errors: 0, Skipped: 0

[INFO] ------------------------------------------------------------------------
[INFO] Reactor Summary:
[INFO] 
[INFO] Repository ........................................ SUCCESS [0.968s]
[INFO] Repository API .................................... SUCCESS [2.932s]
[INFO] Repository Utilities .............................. SUCCESS [1.848s]
[INFO] Repository Connector .............................. SUCCESS [3.124s]
[INFO] Repository Provider Module Interface .............. SUCCESS [1.572s]
[INFO] Repository Test Utilities ......................... SUCCESS [2.588s]
[INFO] Repository Builtin workflow ....................... SUCCESS [0.824s]
[INFO] Repository Engine ................................. FAILURE [3:34.256s]
[INFO] Repository Default Configuration .................. SKIPPED
[INFO] Repository Modules ................................ SKIPPED
[INFO] Repository Test Content ........................... SKIPPED
[INFO] Repository Deprecated ............................. SKIPPED
[INFO] Repository Deprecated Facetselect Mirror .......... SKIPPED
[INFO] Repository workflow implementations ............... SKIPPED
[INFO] Repository Deprecated Translation ................. SKIPPED
[INFO] Repository Deprecated Facetsearch ................. SKIPPED
[INFO] Repository Upgrade Module ......................... SKIPPED
[INFO] Repository Test ................................... SKIPPED
[INFO] Repository LDAP based Authorization ............... SKIPPED
[INFO] Repository Resources .............................. SKIPPED
[INFO] Repository Servlets ............................... SKIPPED
[INFO] Repository Dependencies ........................... SKIPPED
[INFO] ------------------------------------------------------------------------
[INFO] BUILD FAILURE
[INFO] ------------------------------------------------------------------------
[INFO] Total time: 3:49.292s
[INFO] Finished at: Mon Sep 02 12:59:07 CEST 2013
[INFO] Final Memory: 13M/34M
[INFO] ------------------------------------------------------------------------
[INFO] o.h.m.e.h.MavenExecutionResultHandler - Build failed with exception(s)
[INFO] o.h.m.e.h.MavenExecutionResultHandler - [1] org.apache.maven.lifecycle.LifecycleExecutionException: Failed to execute goal org.apache.maven.plugins:maven-surefire-plugin:2.12.4:test (default-test) on project hippo-repository-engine: There are test failures.

Please refer to <https://integration.onehippo.com/job/Repository%20Integration%20Trunk/ws/engine/target/surefire-reports> for the individual test results.
[DEBUG] Closing connection to remote
[ERROR] Failed to execute goal org.apache.maven.plugins:maven-surefire-plugin:2.12.4:test (default-test) on project hippo-repository-engine: There are test failures.
[ERROR] 
[ERROR] Please refer to <https://integration.onehippo.com/job/Repository%20Integration%20Trunk/ws/engine/target/surefire-reports> for the individual test results.
[ERROR] -> [Help 1]
org.apache.maven.lifecycle.LifecycleExecutionException: Failed to execute goal org.apache.maven.plugins:maven-surefire-plugin:2.12.4:test (default-test) on project hippo-repository-engine: There are test failures.

Please refer to <https://integration.onehippo.com/job/Repository%20Integration%20Trunk/ws/engine/target/surefire-reports> for the individual test results.
	at org.apache.maven.lifecycle.internal.MojoExecutor.execute(MojoExecutor.java:213)
	at org.apache.maven.lifecycle.internal.MojoExecutor.execute(MojoExecutor.java:153)
	at org.apache.maven.lifecycle.internal.MojoExecutor.execute(MojoExecutor.java:145)
	at org.apache.maven.lifecycle.internal.LifecycleModuleBuilder.buildProject(LifecycleModuleBuilder.java:84)
	at org.apache.maven.lifecycle.internal.LifecycleModuleBuilder.buildProject(LifecycleModuleBuilder.java:59)
	at org.apache.maven.lifecycle.internal.LifecycleStarter.singleThreadedBuild(LifecycleStarter.java:183)
	at org.apache.maven.lifecycle.internal.LifecycleStarter.execute(LifecycleStarter.java:161)
	at org.apache.maven.DefaultMaven.doExecute(DefaultMaven.java:319)
	at org.apache.maven.DefaultMaven.execute(DefaultMaven.java:156)
	at org.apache.maven.cli.MavenCli.execute(MavenCli.java:537)
	at org.apache.maven.cli.MavenCli.doMain(MavenCli.java:196)
	at org.apache.maven.cli.MavenCli.main(MavenCli.java:141)
	at sun.reflect.NativeMethodAccessorImpl.invoke0(Native Method)
	at sun.reflect.NativeMethodAccessorImpl.invoke(NativeMethodAccessorImpl.java:57)
	at sun.reflect.DelegatingMethodAccessorImpl.invoke(DelegatingMethodAccessorImpl.java:43)
	at java.lang.reflect.Method.invoke(Method.java:601)
	at org.codehaus.plexus.classworlds.launcher.Launcher.launchEnhanced(Launcher.java:290)
	at org.codehaus.plexus.classworlds.launcher.Launcher.launch(Launcher.java:230)
	at org.codehaus.plexus.classworlds.launcher.Launcher.mainWithExitCode(Launcher.java:409)
	at org.codehaus.plexus.classworlds.launcher.Launcher.main(Launcher.java:352)
Caused by: org.apache.maven.plugin.MojoFailureException: There are test failures.

Please refer to <https://integration.onehippo.com/job/Repository%20Integration%20Trunk/ws/engine/target/surefire-reports> for the individual test results.
	at org.apache.maven.plugin.surefire.SurefireHelper.reportExecution(SurefireHelper.java:83)
	at org.apache.maven.plugin.surefire.SurefirePlugin.writeSummary(SurefirePlugin.java:176)
	at org.apache.maven.plugin.surefire.SurefirePlugin.handleSummary(SurefirePlugin.java:150)
	at org.apache.maven.plugin.surefire.AbstractSurefireMojo.executeAfterPreconditionsChecked(AbstractSurefireMojo.java:650)
	at org.apache.maven.plugin.surefire.AbstractSurefireMojo.execute(AbstractSurefireMojo.java:586)
	at org.apache.maven.plugin.DefaultBuildPluginManager.executeMojo(DefaultBuildPluginManager.java:101)
	at org.apache.maven.lifecycle.internal.MojoExecutor.execute(MojoExecutor.java:209)
	... 19 more
[ERROR] 
[ERROR] Re-run Maven using the -X switch to enable full debug logging.
[ERROR] 
[ERROR] For more information about the errors and possible solutions, please read the following articles:
[ERROR] [Help 1] http://cwiki.apache.org/confluence/display/MAVEN/MojoFailureException
[ERROR] 
[ERROR] After correcting the problems, you can resume the build with the command
[ERROR]   mvn <goals> -rf :hippo-repository-engine
[DEBUG] Waiting for process to finish
[DEBUG] Result: 1

--
This message is automatically generated by Hudson. 
For more information on Hudson, see: http://hudson-ci.org/


More information about the Hippo-cms7-dev mailing list