[Hippo-cms7-dev] [Hudson] Build failed in Hudson: hst Trunk #3690

Hippo Public Hudson Server beheer at onehippo.com
Tue Sep 3 14:43:44 CEST 2013


See <https://builds.onehippo.org/job/hst%20Trunk/3690/changes>

Changes:

[Ard Schrijvers] HSTTWO-2682 In case a request gets 'forwarded' the object and/or query managers from the hst request context need to be cleared

------------------------------------------
[...truncated 61 lines...]
[INFO] Hippo Site Toolkit CND Addon Resources
[INFO] Hippo Site Toolkit CND Addon Resources
[INFO] Hippo Site Toolkit Addon Resources to the Repository for Unit Tests
[INFO] Hippo Site Toolkit Test
[INFO] Hippo Site Toolkit Content Beans
[INFO] Hippo Site Toolkit Solr Content Beans
[INFO] Hippo Site Toolkit Components
[INFO] Hippo Site Toolkit Content Rewriter Component
[INFO] Hippo Site Toolkit Addon Resources to the Repository
[INFO] Hippo Site Toolkit JCR Session Pool Component
[INFO] Hippo Site Toolkit ResourceBundle Component
[INFO] Hippo Site Toolkit Core Component
[INFO] Hippo Site Toolkit Client
[INFO] Hippo Site Toolkit Solr Content Beans
[INFO] Hippo Site Toolkit ResourceBundle CND
[INFO] Hippo Site Toolkit Security Component
[INFO] Hippo Site Toolkit JAX-RS Services Component
[INFO] Hippo Site Toolkit REST Models
[INFO] Hippo Site Toolkit Client Modules
[INFO] Hippo Site Toolkit Client Module CMS REST Service
[INFO] Hippo Site Toolkit Client Module Page Composer
[INFO] Hippo Site Toolkit Client Module Google Analytics
[INFO] Hippo Site Toolkit Client Module Google Analytics HST
[INFO] Hippo Site Toolkit Client Module Google Analytics Repository
[INFO] Hippo Site Toolkit Dependencies
[INFO] Hippo Site Toolkit Dependencies For Spring Framework
[INFO] Hippo Site Toolkit Dependencies For Server
[INFO] Hippo Site Toolkit Dependencies For Client
[INFO] Hippo Site Toolkit Dependencies For CMS
[INFO] Hippo Site Toolkit Dependencies For Repository
[INFO] Hippo Site Toolkit Sandbox for Experimental Components
[INFO] Hippo Site Toolkit OCM
[INFO]                                                                         
[INFO] ------------------------------------------------------------------------
[INFO] Building Hippo Site Toolkit 2.27.02-SNAPSHOT
[INFO] ------------------------------------------------------------------------
[INFO] 
[INFO] --- maven-clean-plugin:2.5:clean (default-clean) @ hst ---
[INFO] 
[INFO] --- apache-rat-plugin:0.9.RAT125:check (default) @ hst ---
[INFO] Exclude: **/*.cnd
[INFO] Exclude: **/*.json
[INFO] Exclude: **/*.log
[INFO] Exclude: **/*.patch
[INFO] Exclude: **/*.properties
[INFO] Exclude: **/hippoecm-extension.xml
[INFO] Exclude: **/log4j.dtd
[INFO] Exclude: **/MANIFEST.MF
[INFO] Exclude: **/*.iml
[INFO] Exclude: **/atlassian-ide-plugin.xml
[INFO] Exclude: client-modules/page-composer/src/main/java/org/hippoecm/hst/pagecomposer/jaxrs/cxf/provider/AbstractJsonpOutInterceptor.java
[INFO] Exclude: client-modules/page-composer/src/main/java/org/hippoecm/hst/pagecomposer/jaxrs/cxf/provider/JsonpInInterceptor.java
[INFO] Exclude: client-modules/page-composer/src/main/java/org/hippoecm/hst/pagecomposer/jaxrs/cxf/provider/JsonpPostStreamInterceptor.java
[INFO] Exclude: client-modules/page-composer/src/main/java/org/hippoecm/hst/pagecomposer/jaxrs/cxf/provider/JsonpPreStreamInterceptor.java
[INFO] Exclude: sandbox/WARNINGS
[INFO] Exclude: client-modules/page-composer/src/test/resources/**/*.xml
[INFO] Exclude: toolkit-resources/addon/repository/src/main/resources/**/*.xml
[INFO] Exclude: toolkit-resources/addon/unittestcontents/src/main/resources/**/*.xml
[INFO] Exclude: components/core/src/main/resources/org/hippoecm/hst/core/container/simple-io-template.js
[INFO] 
[INFO] --- maven-remote-resources-plugin:1.4:process (default) @ hst ---
[INFO] 
[INFO] --- maven-source-plugin:2.2.1:jar-no-fork (attach-sources) @ hst ---
[INFO] 
[INFO] --- maven-install-plugin:2.3.1:install (default-install) @ hst ---
projectSucceeded org.onehippo.cms7.hst:hst:2.27.02-SNAPSHOT
[INFO] Installing <https://builds.onehippo.org/job/hst%20Trunk/ws/pom.xml> to /var/hudson-data/repository/m2/org/onehippo/cms7/hst/hst/2.27.02-SNAPSHOT/hst-2.27.02-SNAPSHOT.pom
[HUDSON] Archiving <https://builds.onehippo.org/job/hst%20Trunk/ws/pom.xml> to /var/hudson-data/jobs/hst Trunk/modules/org.onehippo.cms7.hst$hst/builds/2013-09-03_14-42-53/archive/org.onehippo.cms7.hst/hst/2.27.02-SNAPSHOT/pom.xml
[INFO]                                                                         
[INFO] ------------------------------------------------------------------------
[INFO] Building Hippo Site Toolkit API 2.27.02-SNAPSHOT
[INFO] ------------------------------------------------------------------------
Downloading: http://maven.onehippo.com/maven2-snapshots/org/onehippo/cms7/hippo-repository-api/2.25.04-SNAPSHOT/maven-metadata.xml
Downloaded: http://maven.onehippo.com/maven2-snapshots/org/onehippo/cms7/hippo-repository-api/2.25.04-SNAPSHOT/maven-metadata.xml (1013 B at 0.2 KB/sec)
Downloading: http://maven.onehippo.com/maven2-snapshots/org/onehippo/cms7/hippo-repository/2.25.04-SNAPSHOT/maven-metadata.xml
Downloaded: http://maven.onehippo.com/maven2-snapshots/org/onehippo/cms7/hippo-repository/2.25.04-SNAPSHOT/maven-metadata.xml (616 B at 6.5 KB/sec)
[INFO] 
[INFO] --- maven-clean-plugin:2.5:clean (default-clean) @ hst-api ---
[INFO] 
[INFO] --- maven-remote-resources-plugin:1.4:process (default) @ hst-api ---
[INFO] 
[INFO] --- maven-resources-plugin:2.6:resources (default-resources) @ hst-api ---
[INFO] Using 'UTF-8' encoding to copy filtered resources.
[INFO] skip non existing resourceDirectory <https://builds.onehippo.org/job/hst%20Trunk/ws/api/src/main/resources>
[INFO] Copying 3 resources
[INFO] 
[INFO] --- maven-compiler-plugin:2.5.1:compile (default-compile) @ hst-api ---
[INFO] Compiling 270 source files to <https://builds.onehippo.org/job/hst%20Trunk/ws/api/target/classes>
[INFO] 
[INFO] --- maven-resources-plugin:2.6:testResources (default-testResources) @ hst-api ---
[INFO] Using 'UTF-8' encoding to copy filtered resources.
[INFO] skip non existing resourceDirectory <https://builds.onehippo.org/job/hst%20Trunk/ws/api/src/test/resources>
[INFO] Copying 3 resources
[INFO] 
[INFO] --- maven-compiler-plugin:2.5.1:testCompile (default-testCompile) @ hst-api ---
[INFO] Compiling 1 source file to <https://builds.onehippo.org/job/hst%20Trunk/ws/api/target/test-classes>
[INFO] 
[INFO] --- maven-surefire-plugin:2.12.4:test (default-test) @ hst-api ---
[INFO] Surefire report directory: <https://builds.onehippo.org/job/hst%20Trunk/ws/api/target/surefire-reports>

-------------------------------------------------------
 T E S T S
-------------------------------------------------------
Running org.hippoecm.hst.core.component.TestGenericHstComponent
Tests run: 4, Failures: 0, Errors: 0, Skipped: 0, Time elapsed: 0.172 sec

Results :

Tests run: 4, Failures: 0, Errors: 0, Skipped: 0

[HUDSON] Recording test results
[INFO] 
[INFO] --- maven-jar-plugin:2.4:jar (default-jar) @ hst-api ---
[INFO] Building jar: <https://builds.onehippo.org/job/hst%20Trunk/ws/api/target/hst-api-2.27.02-SNAPSHOT.jar>
[INFO] 
[INFO] --- maven-source-plugin:2.2.1:jar-no-fork (attach-sources) @ hst-api ---
[INFO] Building jar: <https://builds.onehippo.org/job/hst%20Trunk/ws/api/target/hst-api-2.27.02-SNAPSHOT-sources.jar>
[INFO] [INFO] Installing <https://builds.onehippo.org/job/hst%20Trunk/ws/api/target/hst-api-2.27.02-SNAPSHOT.jar> to /var/hudson-data/repository/m2/org/onehippo/cms7/hst/hst-api/2.27.02-SNAPSHOT/hst-api-2.27.02-SNAPSHOT.jar
[INFO] Installing <https://builds.onehippo.org/job/hst%20Trunk/ws/api/pom.xml> to /var/hudson-data/repository/m2/org/onehippo/cms7/hst/hst-api/2.27.02-SNAPSHOT/hst-api-2.27.02-SNAPSHOT.pom

[INFO] --- maven-install-plugin:2.3.1:install (default-install) @ hst-api ---
[INFO] Installing <https://builds.onehippo.org/job/hst%20Trunk/ws/api/target/hst-api-2.27.02-SNAPSHOT-sources.jar> to /var/hudson-data/repository/m2/org/onehippo/cms7/hst/hst-api/2.27.02-SNAPSHOT/hst-api-2.27.02-SNAPSHOT-sources.jar
projectSucceeded org.onehippo.cms7.hst:hst-api:2.27.02-SNAPSHOT
[HUDSON] Archiving <https://builds.onehippo.org/job/hst%20Trunk/ws/api/pom.xml> to /var/hudson-data/jobs/hst Trunk/modules/org.onehippo.cms7.hst$hst-api/builds/2013-09-03_14-42-53/archive/org.onehippo.cms7.hst/hst-api/2.27.02-SNAPSHOT/pom.xml
[HUDSON] Archiving <https://builds.onehippo.org/job/hst%20Trunk/ws/api/target/hst-api-2.27.02-SNAPSHOT.jar> to /var/hudson-data/jobs/hst Trunk/modules/org.onehippo.cms7.hst$hst-api/builds/2013-09-03_14-42-53/archive/org.onehippo.cms7.hst/hst-api/2.27.02-SNAPSHOT/hst-api-2.27.02-SNAPSHOT.jar
[HUDSON] Archiving <https://builds.onehippo.org/job/hst%20Trunk/ws/api/target/hst-api-2.27.02-SNAPSHOT-sources.jar> to /var/hudson-data/jobs/hst Trunk/modules/org.onehippo.cms7.hst$hst-api/builds/2013-09-03_14-42-53/archive/org.onehippo.cms7.hst/hst-api/2.27.02-SNAPSHOT/hst-api-2.27.02-SNAPSHOT-sources.jar
[INFO]                                                                         
[INFO] ------------------------------------------------------------------------
[INFO] Building Hippo Site Toolkit Commons 2.27.02-SNAPSHOT
[INFO] ------------------------------------------------------------------------
[INFO] 
[INFO] --- maven-clean-plugin:2.5:clean (default-clean) @ hst-commons ---
[INFO] 
[INFO] --- maven-remote-resources-plugin:1.4:process (default) @ hst-commons ---
[INFO] [INFO] Using 'UTF-8' encoding to copy filtered resources.
[INFO] skip non existing resourceDirectory <https://builds.onehippo.org/job/hst%20Trunk/ws/commons/src/main/resources>
[INFO] Copying 3 resources

[INFO] --- maven-resources-plugin:2.6:resources (default-resources) @ hst-commons ---
[INFO] [INFO] Compiling 55 source files to <https://builds.onehippo.org/job/hst%20Trunk/ws/commons/target/classes>

[INFO] --- maven-compiler-plugin:2.5.1:compile (default-compile) @ hst-commons ---
mojoFailed org.apache.maven.plugins:maven-compiler-plugin:2.5.1(default-compile)
[INFO] -------------------------------------------------------------
[ERROR] COMPILATION ERROR : 
[INFO] -------------------------------------------------------------
[ERROR] <https://builds.onehippo.org/job/hst%20Trunk/ws/commons/src/main/java/org/hippoecm/hst/container/HstFilter.java>:[848,26] cannot find symbol
symbol  : method clearObjectAndQueryManagers()
location: interface org.hippoecm.hst.core.internal.HstMutableRequestContext
[INFO] 1 error
[INFO] -------------------------------------------------------------
projectFailed org.onehippo.cms7.hst:hst-commons:2.27.02-SNAPSHOT
[HUDSON] Archiving <https://builds.onehippo.org/job/hst%20Trunk/ws/commons/pom.xml> to /var/hudson-data/jobs/hst Trunk/modules/org.onehippo.cms7.hst$hst-commons/builds/2013-09-03_14-42-53/archive/org.onehippo.cms7.hst/hst-commons/2.27.02-SNAPSHOT/pom.xml
sessionEnded
[INFO] ------------------------------------------------------------------------
[INFO] Reactor Summary:
[INFO] 
[INFO] Hippo Site Toolkit ................................ SUCCESS [12.788s]
[INFO] Hippo Site Toolkit API ............................ SUCCESS [15.276s]
[INFO] Hippo Site Toolkit Commons ........................ FAILURE [2.488s]
[INFO] Hippo Site Toolkit Mock ........................... SKIPPED
[INFO] Hippo Site Toolkit Resources ...................... SKIPPED
[INFO] Hippo Site Toolkit Addon Resources ................ SKIPPED
[INFO] Hippo Site Toolkit CND Addon Resources ............ SKIPPED
[INFO] Hippo Site Toolkit CND Addon Resources ............ SKIPPED
[INFO] Hippo Site Toolkit Addon Resources to the Repository for Unit Tests  SKIPPED
[INFO] Hippo Site Toolkit Test ........................... SKIPPED
[INFO] Hippo Site Toolkit Content Beans .................. SKIPPED
[INFO] Hippo Site Toolkit Solr Content Beans ............. SKIPPED
[INFO] Hippo Site Toolkit Components ..................... SKIPPED
[INFO] Hippo Site Toolkit Content Rewriter Component ..... SKIPPED
[INFO] Hippo Site Toolkit Addon Resources to the Repository  SKIPPED
[INFO] Hippo Site Toolkit JCR Session Pool Component ..... SKIPPED
[INFO] Hippo Site Toolkit ResourceBundle Component ....... SKIPPED
[INFO] Hippo Site Toolkit Core Component ................. SKIPPED
[INFO] Hippo Site Toolkit Client ......................... SKIPPED
[INFO] Hippo Site Toolkit Solr Content Beans ............. SKIPPED
[INFO] Hippo Site Toolkit ResourceBundle CND ............. SKIPPED
[INFO] Hippo Site Toolkit Security Component ............. SKIPPED
[INFO] Hippo Site Toolkit JAX-RS Services Component ...... SKIPPED
[INFO] Hippo Site Toolkit REST Models .................... SKIPPED
[INFO] Hippo Site Toolkit Client Modules ................. SKIPPED
[INFO] Hippo Site Toolkit Client Module CMS REST Service . SKIPPED
[INFO] Hippo Site Toolkit Client Module Page Composer .... SKIPPED
[INFO] Hippo Site Toolkit Client Module Google Analytics . SKIPPED
[INFO] Hippo Site Toolkit Client Module Google Analytics HST  SKIPPED
[INFO] Hippo Site Toolkit Client Module Google Analytics Repository  SKIPPED
[INFO] Hippo Site Toolkit Dependencies ................... SKIPPED
[INFO] Hippo Site Toolkit Dependencies For Spring Framework  SKIPPED
[INFO] Hippo Site Toolkit Dependencies For Server ........ SKIPPED
[INFO] Hippo Site Toolkit Dependencies For Client ........ SKIPPED
[INFO] Hippo Site Toolkit Dependencies For CMS ........... SKIPPED
[INFO] Hippo Site Toolkit Dependencies For Repository .... SKIPPED
[INFO] Hippo Site Toolkit Sandbox for Experimental Components  SKIPPED
[INFO] Hippo Site Toolkit OCM ............................ SKIPPED
[INFO] ------------------------------------------------------------------------
[INFO] BUILD FAILURE
[INFO] ------------------------------------------------------------------------
[INFO] Total time: 36.968s
[INFO] Finished at: Tue Sep 03 14:43:35 CEST 2013
[INFO] Final Memory: 17M/41M
[INFO] ------------------------------------------------------------------------
maven builder waiting
mavenExecutionResult exceptions not empty
org.apache.maven.lifecycle.LifecycleExecutionException: Failed to execute goal org.apache.maven.plugins:maven-compiler-plugin:2.5.1:compile (default-compile) on project hst-commons: Compilation failure
<https://builds.onehippo.org/job/hst%20Trunk/ws/commons/src/main/java/org/hippoecm/hst/container/HstFilter.java>:[848,26] cannot find symbol
symbol  : method clearObjectAndQueryManagers()
location: interface org.hippoecm.hst.core.internal.HstMutableRequestContext

	at org.apache.maven.lifecycle.internal.MojoExecutor.execute(MojoExecutor.java:213)
	at org.apache.maven.lifecycle.internal.MojoExecutor.execute(MojoExecutor.java:153)
	at org.apache.maven.lifecycle.internal.MojoExecutor.execute(MojoExecutor.java:145)
	at org.apache.maven.lifecycle.internal.LifecycleModuleBuilder.buildProject(LifecycleModuleBuilder.java:84)
	at org.apache.maven.lifecycle.internal.LifecycleModuleBuilder.buildProject(LifecycleModuleBuilder.java:59)
	at org.apache.maven.lifecycle.internal.LifecycleStarter.singleThreadedBuild(LifecycleStarter.java:183)
	at org.apache.maven.lifecycle.internal.LifecycleStarter.execute(LifecycleStarter.java:161)
	at org.apache.maven.DefaultMaven.doExecute(DefaultMaven.java:320)
	at org.apache.maven.DefaultMaven.execute(DefaultMaven.java:156)
	at org.jvnet.hudson.maven3.launcher.Maven3Launcher.main(Maven3Launcher.java:79)
	at sun.reflect.NativeMethodAccessorImpl.invoke0(Native Method)
	at sun.reflect.NativeMethodAccessorImpl.invoke(NativeMethodAccessorImpl.java:39)
	at sun.reflect.DelegatingMethodAccessorImpl.invoke(DelegatingMethodAccessorImpl.java:25)
	at java.lang.reflect.Method.invoke(Method.java:597)
	at org.codehaus.plexus.classworlds.launcher.Launcher.launchStandard(Launcher.java:329)
	at org.codehaus.plexus.classworlds.launcher.Launcher.launch(Launcher.java:239)
	at org.jvnet.hudson.maven3.agent.Maven3Main.launch(Maven3Main.java:146)
	at hudson.maven.Maven3Builder.call(Maven3Builder.java:124)
	at hudson.maven.Maven3Builder.call(Maven3Builder.java:71)
	at hudson.remoting.UserRequest.perform(UserRequest.java:107)
	at hudson.remoting.UserRequest.perform(UserRequest.java:41)
	at hudson.remoting.Request$2.run(Request.java:276)
	at java.util.concurrent.Executors$RunnableAdapter.call(Executors.java:441)
	at java.util.concurrent.FutureTask$Sync.innerRun(FutureTask.java:303)
	at java.util.concurrent.FutureTask.run(FutureTask.java:138)
	at java.util.concurrent.ThreadPoolExecutor$Worker.runTask(ThreadPoolExecutor.java:886)
	at java.util.concurrent.ThreadPoolExecutor$Worker.run(ThreadPoolExecutor.java:908)
	at java.lang.Thread.run(Thread.java:662)
Caused by: org.apache.maven.plugin.CompilationFailureException: Compilation failure
<https://builds.onehippo.org/job/hst%20Trunk/ws/commons/src/main/java/org/hippoecm/hst/container/HstFilter.java>:[848,26] cannot find symbol
symbol  : method clearObjectAndQueryManagers()
location: interface org.hippoecm.hst.core.internal.HstMutableRequestContext

	at org.apache.maven.plugin.AbstractCompilerMojo.execute(AbstractCompilerMojo.java:729)
	at org.apache.maven.plugin.CompilerMojo.execute(CompilerMojo.java:128)
	at org.apache.maven.plugin.DefaultBuildPluginManager.executeMojo(DefaultBuildPluginManager.java:101)
	at org.apache.maven.lifecycle.internal.MojoExecutor.execute(MojoExecutor.java:209)
	... 27 more
Sending e-mails to: hippo-cms7-dev at lists.onehippo.org
channel stopped

--
This message is automatically generated by Hudson. 
For more information on Hudson, see: http://hudson-ci.org/


More information about the Hippo-cms7-dev mailing list