[Hippo-cms7-dev] [Hudson] Build failed in Hudson: Repository Integration Trunk #664

Hippo Integration Hudson Server beheer at onehippo.com
Tue Sep 3 20:40:13 CEST 2013


See <https://integration.onehippo.com/job/Repository%20Integration%20Trunk/664/changes>

Changes:

[Frank van Lankvelt] REPO-734: clear repo before creating new one
this has the effect that each module will run with the same (running) instance.
different modules will have their own repository, so their (imported) content can be different

[aschrijvers] REPO-707 Improve some unit tests to also include changes in existing hits and direct fac nav searches again after the change: The result should be directly affected by the changed document

------------------------------------------
[...truncated 1298 lines...]
	at org.apache.jackrabbit.core.state.SessionItemStateManager.update(SessionItemStateManager.java:275)
	at org.apache.jackrabbit.core.ItemSaveOperation.perform(ItemSaveOperation.java:258)
	... 18 more
03.09.2013 20:11:19 ERROR [org.hippoecm.repository.standardworkflow.FolderWorkflowImpl.doArchive():375] error while deleting document variants from attic
javax.jcr.InvalidItemStateException: Unable to update a stale item: item.save()
	at org.apache.jackrabbit.core.ItemSaveOperation.perform(ItemSaveOperation.java:262)
	at org.apache.jackrabbit.core.session.SessionState.perform(SessionState.java:216)
	at org.apache.jackrabbit.core.ItemImpl.perform(ItemImpl.java:91)
	at org.apache.jackrabbit.core.ItemImpl.save(ItemImpl.java:329)
	at org.hippoecm.repository.decorating.ItemDecorator.save(ItemDecorator.java:142)
	at org.hippoecm.repository.impl.NodeDecorator.save(NodeDecorator.java:96)
	at org.hippoecm.repository.standardworkflow.FolderWorkflowImpl.doArchive(FolderWorkflowImpl.java:371)
	at org.hippoecm.repository.standardworkflow.FolderWorkflowImpl.archive(FolderWorkflowImpl.java:431)
	at sun.reflect.NativeMethodAccessorImpl.invoke0(Native Method)
	at sun.reflect.NativeMethodAccessorImpl.invoke(NativeMethodAccessorImpl.java:57)
	at sun.reflect.DelegatingMethodAccessorImpl.invoke(DelegatingMethodAccessorImpl.java:43)
	at java.lang.reflect.Method.invoke(Method.java:601)
	at org.hippoecm.repository.impl.WorkflowManagerImpl$WorkflowInvocationImpl.invoke(WorkflowManagerImpl.java:867)
	at org.hippoecm.repository.impl.WorkflowManagerImpl$WorkflowInvocationHandler.invoke(WorkflowManagerImpl.java:536)
	at $Proxy19.delete(Unknown Source)
	at org.hippoecm.repository.concurrent.action.DeleteDocumentAction.doExecute(DeleteDocumentAction.java:29)
	at org.hippoecm.repository.concurrent.action.Action.execute(Action.java:43)
	at org.hippoecm.repository.concurrent.AbstractRandomActionTest$RandomActionRunner.step(AbstractRandomActionTest.java:251)
	at org.hippoecm.repository.concurrent.AbstractRandomActionTest$RandomActionRunner.run(AbstractRandomActionTest.java:192)
Caused by: org.apache.jackrabbit.core.state.StaleItemStateException: 6e4e01a8-94bb-4ca6-abe1-cdcbc3fca210/{http://www.jcp.org/jcr/1.0}predecessors has been modified externally
	at org.apache.jackrabbit.core.state.SharedItemStateManager$Update.begin(SharedItemStateManager.java:697)
	at org.apache.jackrabbit.core.state.SharedItemStateManager.beginUpdate(SharedItemStateManager.java:1507)
	at org.apache.jackrabbit.core.state.SharedItemStateManager.update(SharedItemStateManager.java:1537)
	at org.hippoecm.repository.jackrabbit.HippoSharedItemStateManager.update(HippoSharedItemStateManager.java:90)
	at org.apache.jackrabbit.core.state.LocalItemStateManager.update(LocalItemStateManager.java:400)
	at org.apache.jackrabbit.core.state.XAItemStateManager.update(XAItemStateManager.java:354)
	at org.hippoecm.repository.jackrabbit.HippoLocalItemStateManager.update(HippoLocalItemStateManager.java:280)
	at org.apache.jackrabbit.core.state.LocalItemStateManager.update(LocalItemStateManager.java:375)
	at org.hippoecm.repository.jackrabbit.HippoLocalItemStateManager.update(HippoLocalItemStateManager.java:289)
	at org.apache.jackrabbit.core.state.SessionItemStateManager.update(SessionItemStateManager.java:275)
	at org.apache.jackrabbit.core.ItemSaveOperation.perform(ItemSaveOperation.java:258)
	... 18 more
GetDocumentBaseNodeAction executed 148 times; failed 0 times; total time spent 8 ms; average time 0
GetAssetBaseNodeAction executed 73 times; failed 0 times; total time spent 0 ms; average time 0
GetRandomChildNodeAction executed 277 times; failed 0 times; total time spent 76 ms; average time 0
AddDocumentFolderAction executed 11 times; failed 0 times; total time spent 304 ms; average time 27
AddAssetFolderAction executed 38 times; failed 0 times; total time spent 6160 ms; average time 162
AddNewsDocumentAction executed 70 times; failed 0 times; total time spent 13160 ms; average time 188
PublishAction executed 38 times; failed 0 times; total time spent 11788 ms; average time 310
DepublishAction executed 26 times; failed 0 times; total time spent 16932 ms; average time 651
DeleteDocumentAction executed 36 times; failed 0 times; total time spent 26728 ms; average time 742
LoadDocumentAction executed 193 times; failed 0 times; total time spent 300 ms; average time 1
AddDocumentLinkAction executed 82 times; failed 0 times; total time spent 14576 ms; average time 177
EditDocumentAction executed 38 times; failed 0 times; total time spent 20516 ms; average time 539
AddAssetAction executed 38 times; failed 0 times; total time spent 9760 ms; average time 256
DeleteAssetAction executed 29 times; failed 0 times; total time spent 3496 ms; average time 120
RenameAssetAction executed 27 times; failed 0 times; total time spent 4928 ms; average time 182
DeleteFolderAction executed 24 times; failed 0 times; total time spent 712 ms; average time 29
RenameDocumentAction executed 46 times; failed 0 times; total time spent 5456 ms; average time 118
MoveDocumentAction executed 20 times; failed 0 times; total time spent 2736 ms; average time 136
Total actions run: 1214
Total successful actions: 1206
Total write actions run: 523
Total missed actions: 8
Total failed actions: 0
Successrate: 1.0
Total time it took: 61.92 sec
Tests run: 1, Failures: 0, Errors: 0, Skipped: 0, Time elapsed: 84.052 sec - in org.hippoecm.repository.concurrent.StampedeTest
Running org.hippoecm.repository.updater.UpdaterTest
Tests run: 3, Failures: 0, Errors: 0, Skipped: 0, Time elapsed: 49.372 sec - in org.hippoecm.repository.updater.UpdaterTest
Running org.hippoecm.repository.sample.SampleRemoteWorkflowTest
Tests run: 2, Failures: 0, Errors: 0, Skipped: 0, Time elapsed: 58.044 sec - in org.hippoecm.repository.sample.SampleRemoteWorkflowTest
Running org.hippoecm.repository.facetnavigation.FacetedNavigationConcurrencyTest
Exception in thread "Hippo JCR Quartz Job Scheduler_QuartzSchedulerThread" java.lang.OutOfMemoryError: Java heap space
	at org.apache.jackrabbit.core.query.lucene.sort.AbstractFieldComparator.<init>(AbstractFieldComparator.java:56)
	at org.apache.jackrabbit.core.query.lucene.SharedFieldComparatorSource$SimpleFieldComparator.<init>(SharedFieldComparatorSource.java:141)
	at org.apache.jackrabbit.core.query.lucene.SharedFieldComparatorSource.newComparator(SharedFieldComparatorSource.java:99)
	at org.apache.lucene.search.SortField.getComparator(SortField.java:425)
	at org.apache.lucene.search.FieldValueHitQueue$OneComparatorFieldValueHitQueue.<init>(FieldValueHitQueue.java:64)
	at org.apache.lucene.search.FieldValueHitQueue.create(FieldValueHitQueue.java:173)
	at org.apache.lucene.search.TopFieldCollector.create(TopFieldCollector.java:916)
	at org.hippoecm.repository.query.lucene.HippoSortedLuceneQueryHits.getHits(HippoSortedLuceneQueryHits.java:164)
	at org.hippoecm.repository.query.lucene.HippoSortedLuceneQueryHits.<init>(HippoSortedLuceneQueryHits.java:122)
	at org.hippoecm.repository.query.lucene.HippoIndexSearcher.evaluate(HippoIndexSearcher.java:56)
	at org.apache.jackrabbit.core.query.lucene.JackrabbitIndexSearcher.execute(JackrabbitIndexSearcher.java:85)
	at org.hippoecm.repository.query.lucene.ServicingSearchIndex.executeQuery(ServicingSearchIndex.java:198)
	at org.hippoecm.repository.query.lucene.HippoQueryResult.executeQuery(HippoQueryResult.java:72)
	at org.apache.jackrabbit.core.query.lucene.QueryResultImpl.getResults(QueryResultImpl.java:284)
	at org.hippoecm.repository.query.lucene.HippoQueryResult.<init>(HippoQueryResult.java:64)
	at org.hippoecm.repository.query.lucene.ServicingSearchIndex$3.execute(ServicingSearchIndex.java:287)
	at org.apache.jackrabbit.core.query.QueryImpl$1.perform(QueryImpl.java:132)
	at org.apache.jackrabbit.core.query.QueryImpl$1.perform(QueryImpl.java:129)
	at org.apache.jackrabbit.core.session.SessionState.perform(SessionState.java:216)
	at org.apache.jackrabbit.core.query.QueryImpl.execute(QueryImpl.java:128)
	at org.hippoecm.repository.impl.QueryDecorator.execute(QueryDecorator.java:393)
	at org.hippoecm.repository.impl.QueryDecorator.execute(QueryDecorator.java:90)
	at org.hippoecm.repository.quartz.JCRJobStore.getPendingTriggers(JCRJobStore.java:446)
	at org.hippoecm.repository.quartz.JCRJobStore.acquireNextTrigger(JCRJobStore.java:243)
	at org.quartz.core.QuartzSchedulerThread.run(QuartzSchedulerThread.java:264)
Exception: java.lang.OutOfMemoryError thrown from the UncaughtExceptionHandler in thread "Thread-207"
Exception: java.lang.OutOfMemoryError thrown from the UncaughtExceptionHandler in thread "Thread-214"
Exception in thread "Thread-202" java.lang.OutOfMemoryError: Java heap space
	at java.util.concurrent.CopyOnWriteArrayList.iterator(CopyOnWriteArrayList.java:959)
	at org.apache.jackrabbit.core.state.StateChangeDispatcher.notifyNodeAdded(StateChangeDispatcher.java:146)
	at org.apache.jackrabbit.core.state.SessionItemStateManager.nodeAdded(SessionItemStateManager.java:877)
	at org.apache.jackrabbit.core.state.StateChangeDispatcher.notifyNodeAdded(StateChangeDispatcher.java:149)
	at org.apache.jackrabbit.core.state.LocalItemStateManager.nodeAdded(LocalItemStateManager.java:578)
	at org.apache.jackrabbit.core.state.NodeState.notifyNodeAdded(NodeState.java:892)
	at org.apache.jackrabbit.core.state.NodeState.addChildNodeEntry(NodeState.java:332)
	at org.hippoecm.repository.jackrabbit.FacetResultSetProvider.populate(FacetResultSetProvider.java:259)
	at org.hippoecm.repository.dataprovider.HippoVirtualProvider.populate(HippoVirtualProvider.java:135)
	at org.hippoecm.repository.dataprovider.HippoNodeId.populate(HippoNodeId.java:67)
	at org.hippoecm.repository.jackrabbit.HippoLocalItemStateManager.getNodeState(HippoLocalItemStateManager.java:444)
	at org.apache.jackrabbit.core.state.LocalItemStateManager.getItemState(LocalItemStateManager.java:175)
	at org.apache.jackrabbit.core.state.XAItemStateManager.getItemState(XAItemStateManager.java:260)
	at org.hippoecm.repository.jackrabbit.HippoLocalItemStateManager.getItemState(HippoLocalItemStateManager.java:338)
	at org.apache.jackrabbit.core.state.SessionItemStateManager.getItemState(SessionItemStateManager.java:161)
	at org.apache.jackrabbit.core.ItemManager.getItemData(ItemManager.java:382)
	at org.apache.jackrabbit.core.ItemManager.getNode(ItemManager.java:669)
	at org.apache.jackrabbit.core.ItemManager.getNode(ItemManager.java:647)
	at org.apache.jackrabbit.core.LazyItemIterator.prefetchNext(LazyItemIterator.java:120)
	at org.apache.jackrabbit.core.LazyItemIterator.next(LazyItemIterator.java:257)
	at org.hippoecm.repository.decorating.RangeIteratorDecorator.next(RangeIteratorDecorator.java:112)
	at org.hippoecm.repository.decorating.NodeIteratorDecorator.nextNode(NodeIteratorDecorator.java:54)
	at org.hippoecm.repository.facetnavigation.FacetedNavigationConcurrencyTest.traverse(FacetedNavigationConcurrencyTest.java:404)
	at org.hippoecm.repository.facetnavigation.FacetedNavigationConcurrencyTest.traverse(FacetedNavigationConcurrencyTest.java:405)
	at org.hippoecm.repository.facetnavigation.FacetedNavigationConcurrencyTest.traverse(FacetedNavigationConcurrencyTest.java:405)
	at org.hippoecm.repository.facetnavigation.FacetedNavigationConcurrencyTest.access$500(FacetedNavigationConcurrencyTest.java:50)
	at org.hippoecm.repository.facetnavigation.FacetedNavigationConcurrencyTest$FacetedTraverser.run(FacetedNavigationConcurrencyTest.java:456)
	at org.hippoecm.repository.facetnavigation.FacetedNavigationConcurrencyTest$Worker.run(FacetedNavigationConcurrencyTest.java:490)
Exception: java.lang.OutOfMemoryError thrown from the UncaughtExceptionHandler in thread "Thread-216"
Exception: java.lang.OutOfMemoryError thrown from the UncaughtExceptionHandler in thread "Thread-232"
Exception in thread "Thread-205" java.lang.OutOfMemoryError: Java heap space
	at org.apache.jackrabbit.core.cache.CacheManager.resizeAll(CacheManager.java:197)
	at org.apache.jackrabbit.core.cache.CacheManager.cacheAccessed(CacheManager.java:150)
	at org.apache.jackrabbit.core.cache.AbstractCache.recordCacheAccess(AbstractCache.java:122)
	at org.apache.jackrabbit.core.cache.ConcurrentCache.get(ConcurrentCache.java:122)
	at org.apache.jackrabbit.core.state.MLRUItemStateCache.retrieve(MLRUItemStateCache.java:71)
	at org.apache.jackrabbit.core.state.ItemStateReferenceCache.retrieve(ItemStateReferenceCache.java:139)
	at org.apache.jackrabbit.core.state.SharedItemStateManager.getNonVirtualItemState(SharedItemStateManager.java:1761)
	at org.apache.jackrabbit.core.state.SharedItemStateManager.getItemState(SharedItemStateManager.java:270)
	at org.apache.jackrabbit.core.state.LocalItemStateManager.getPropertyState(LocalItemStateManager.java:135)
	at org.hippoecm.repository.jackrabbit.HippoLocalItemStateManager.getPropertyState(HippoLocalItemStateManager.java:528)
	at org.apache.jackrabbit.core.state.LocalItemStateManager.getItemState(LocalItemStateManager.java:177)
	at org.apache.jackrabbit.core.state.XAItemStateManager.getItemState(XAItemStateManager.java:260)
	at org.hippoecm.repository.jackrabbit.HippoLocalItemStateManager.getItemState(HippoLocalItemStateManager.java:338)
	at org.hippoecm.repository.dataprovider.HippoVirtualProvider.getPropertyState(HippoVirtualProvider.java:196)
	at org.hippoecm.repository.jackrabbit.MirrorVirtualProvider.populate(MirrorVirtualProvider.java:131)
	at org.hippoecm.repository.dataprovider.HippoNodeId.populate(HippoNodeId.java:67)
	at org.hippoecm.repository.jackrabbit.HippoLocalItemStateManager.getNodeState(HippoLocalItemStateManager.java:444)
	at org.apache.jackrabbit.core.state.LocalItemStateManager.getItemState(LocalItemStateManager.java:175)
	at org.apache.jackrabbit.core.state.XAItemStateManager.getItemState(XAItemStateManager.java:260)
	at org.hippoecm.repository.jackrabbit.HippoLocalItemStateManager.getItemState(HippoLocalItemStateManager.java:338)
	at org.apache.jackrabbit.core.state.SessionItemStateManager.getItemState(SessionItemStateManager.java:161)
	at org.apache.jackrabbit.core.ItemManager.getItemData(ItemManager.java:382)
Exception: java.lang.OutOfMemoryError thrown from the UncaughtExceptionHandler in thread "Thread-205"
Exception: java.lang.OutOfMemoryError thrown from the UncaughtExceptionHandler in thread "Thread-224"
Exception: java.lang.OutOfMemoryError thrown from the UncaughtExceptionHandler in thread "Thread-226"
Exception: java.lang.OutOfMemoryError thrown from the UncaughtExceptionHandler in thread "Thread-197"
Exception: java.lang.OutOfMemoryError thrown from the UncaughtExceptionHandler in thread "Thread-203"
Tests run: 2, Failures: 0, Errors: 0, Skipped: 0, Time elapsed: 1,513.088 sec - in org.hippoecm.repository.facetnavigation.FacetedNavigationConcurrencyTest
java.lang.OutOfMemoryError: Java heap space
Exception: java.lang.OutOfMemoryError thrown from the UncaughtExceptionHandler in thread "Thread-199"

Results :

Tests run: 8, Failures: 0, Errors: 0, Skipped: 0

[INFO] ------------------------------------------------------------------------
[INFO] Reactor Summary:
[INFO] 
[INFO] Repository ........................................ SUCCESS [2.152s]
[INFO] Repository API .................................... SUCCESS [4.160s]
[INFO] Repository Utilities .............................. SUCCESS [1.748s]
[INFO] Repository Connector .............................. SUCCESS [4.544s]
[INFO] Repository Provider Module Interface .............. SUCCESS [1.748s]
[INFO] Repository Test Utilities ......................... SUCCESS [2.852s]
[INFO] Repository Builtin workflow ....................... SUCCESS [0.992s]
[INFO] Repository Engine ................................. SUCCESS [2:28.124s]
[INFO] Repository Default Configuration .................. SUCCESS [19.768s]
[INFO] Repository Modules ................................ SUCCESS [23.100s]
[INFO] Repository Test Content ........................... SUCCESS [0.232s]
[INFO] Repository Deprecated ............................. SUCCESS [0.060s]
[INFO] Repository Deprecated Facetselect Mirror .......... SUCCESS [14.376s]
[INFO] Repository workflow implementations ............... SUCCESS [7:08.216s]
[INFO] Repository Deprecated Translation ................. SUCCESS [15.876s]
[INFO] Repository Deprecated Facetsearch ................. SUCCESS [18.792s]
[INFO] Repository Upgrade Module ......................... SUCCESS [9.468s]
[INFO] Repository Test ................................... FAILURE [31:13.236s]
[INFO] Repository LDAP based Authorization ............... SKIPPED
[INFO] Repository Resources .............................. SKIPPED
[INFO] Repository Servlets ............................... SKIPPED
[INFO] Repository Dependencies ........................... SKIPPED
[INFO] ------------------------------------------------------------------------
[INFO] BUILD FAILURE
[INFO] ------------------------------------------------------------------------
[INFO] Total time: 42:51.816s
[INFO] Finished at: Tue Sep 03 20:40:12 CEST 2013
[INFO] Final Memory: 17M/43M
[INFO] ------------------------------------------------------------------------
[INFO] o.h.m.e.h.MavenExecutionResultHandler - Build failed with exception(s)
[INFO] o.h.m.e.h.MavenExecutionResultHandler - [1] org.apache.maven.lifecycle.LifecycleExecutionException: Failed to execute goal org.apache.maven.plugins:maven-failsafe-plugin:2.16:integration-test (default) on project hippo-repository-test: Execution default of goal org.apache.maven.plugins:maven-failsafe-plugin:2.16:integration-test failed: The forked VM terminated without saying properly goodbye. VM crash or System.exit called ?
Command was/bin/sh -c cd "<https://integration.onehippo.com/job/Repository%20Integration%20Trunk/ws/test"> && /var/hudson-data/software/jvm/jdk1.7.0_10/jre/bin/java -jar '<https://integration.onehippo.com/job/Repository%20Integration%20Trunk/ws/test/target/surefire/surefirebooter5816505753547686747.jar'> '<https://integration.onehippo.com/job/Repository%20Integration%20Trunk/ws/test/target/surefire/surefire1301399964798615457tmp'> '<https://integration.onehippo.com/job/Repository%20Integration%20Trunk/ws/test/target/surefire/surefire_17480997183653862167tmp'>
[DEBUG] Closing connection to remote
[ERROR] Failed to execute goal org.apache.maven.plugins:maven-failsafe-plugin:2.16:integration-test (default) on project hippo-repository-test: Execution default of goal org.apache.maven.plugins:maven-failsafe-plugin:2.16:integration-test failed: The forked VM terminated without saying properly goodbye. VM crash or System.exit called ?
[ERROR] Command was/bin/sh -c cd "<https://integration.onehippo.com/job/Repository%20Integration%20Trunk/ws/test"> && /var/hudson-data/software/jvm/jdk1.7.0_10/jre/bin/java -jar '<https://integration.onehippo.com/job/Repository%20Integration%20Trunk/ws/test/target/surefire/surefirebooter5816505753547686747.jar'> '<https://integration.onehippo.com/job/Repository%20Integration%20Trunk/ws/test/target/surefire/surefire1301399964798615457tmp'> '<https://integration.onehippo.com/job/Repository%20Integration%20Trunk/ws/test/target/surefire/surefire_17480997183653862167tmp'>
[ERROR] -> [Help 1]
org.apache.maven.lifecycle.LifecycleExecutionException: Failed to execute goal org.apache.maven.plugins:maven-failsafe-plugin:2.16:integration-test (default) on project hippo-repository-test: Execution default of goal org.apache.maven.plugins:maven-failsafe-plugin:2.16:integration-test failed: The forked VM terminated without saying properly goodbye. VM crash or System.exit called ?
Command was/bin/sh -c cd "<https://integration.onehippo.com/job/Repository%20Integration%20Trunk/ws/test"> && /var/hudson-data/software/jvm/jdk1.7.0_10/jre/bin/java -jar '<https://integration.onehippo.com/job/Repository%20Integration%20Trunk/ws/test/target/surefire/surefirebooter5816505753547686747.jar'> '<https://integration.onehippo.com/job/Repository%20Integration%20Trunk/ws/test/target/surefire/surefire1301399964798615457tmp'> '<https://integration.onehippo.com/job/Repository%20Integration%20Trunk/ws/test/target/surefire/surefire_17480997183653862167tmp'>
	at org.apache.maven.lifecycle.internal.MojoExecutor.execute(MojoExecutor.java:225)
	at org.apache.maven.lifecycle.internal.MojoExecutor.execute(MojoExecutor.java:153)
	at org.apache.maven.lifecycle.internal.MojoExecutor.execute(MojoExecutor.java:145)
	at org.apache.maven.lifecycle.internal.LifecycleModuleBuilder.buildProject(LifecycleModuleBuilder.java:84)
	at org.apache.maven.lifecycle.internal.LifecycleModuleBuilder.buildProject(LifecycleModuleBuilder.java:59)
	at org.apache.maven.lifecycle.internal.LifecycleStarter.singleThreadedBuild(LifecycleStarter.java:183)
	at org.apache.maven.lifecycle.internal.LifecycleStarter.execute(LifecycleStarter.java:161)
	at org.apache.maven.DefaultMaven.doExecute(DefaultMaven.java:319)
	at org.apache.maven.DefaultMaven.execute(DefaultMaven.java:156)
	at org.apache.maven.cli.MavenCli.execute(MavenCli.java:537)
	at org.apache.maven.cli.MavenCli.doMain(MavenCli.java:196)
	at org.apache.maven.cli.MavenCli.main(MavenCli.java:141)
	at sun.reflect.NativeMethodAccessorImpl.invoke0(Native Method)
	at sun.reflect.NativeMethodAccessorImpl.invoke(NativeMethodAccessorImpl.java:57)
	at sun.reflect.DelegatingMethodAccessorImpl.invoke(DelegatingMethodAccessorImpl.java:43)
	at java.lang.reflect.Method.invoke(Method.java:601)
	at org.codehaus.plexus.classworlds.launcher.Launcher.launchEnhanced(Launcher.java:290)
	at org.codehaus.plexus.classworlds.launcher.Launcher.launch(Launcher.java:230)
	at org.codehaus.plexus.classworlds.launcher.Launcher.mainWithExitCode(Launcher.java:409)
	at org.codehaus.plexus.classworlds.launcher.Launcher.main(Launcher.java:352)
Caused by: org.apache.maven.plugin.PluginExecutionException: Execution default of goal org.apache.maven.plugins:maven-failsafe-plugin:2.16:integration-test failed: The forked VM terminated without saying properly goodbye. VM crash or System.exit called ?
Command was/bin/sh -c cd "<https://integration.onehippo.com/job/Repository%20Integration%20Trunk/ws/test"> && /var/hudson-data/software/jvm/jdk1.7.0_10/jre/bin/java -jar '<https://integration.onehippo.com/job/Repository%20Integration%20Trunk/ws/test/target/surefire/surefirebooter5816505753547686747.jar'> '<https://integration.onehippo.com/job/Repository%20Integration%20Trunk/ws/test/target/surefire/surefire1301399964798615457tmp'> '<https://integration.onehippo.com/job/Repository%20Integration%20Trunk/ws/test/target/surefire/surefire_17480997183653862167tmp'>
	at org.apache.maven.plugin.DefaultBuildPluginManager.executeMojo(DefaultBuildPluginManager.java:110)
	at org.apache.maven.lifecycle.internal.MojoExecutor.execute(MojoExecutor.java:209)
	... 19 more
Caused by: java.lang.RuntimeException: The forked VM terminated without saying properly goodbye. VM crash or System.exit called ?
Command was/bin/sh -c cd "<https://integration.onehippo.com/job/Repository%20Integration%20Trunk/ws/test"> && /var/hudson-data/software/jvm/jdk1.7.0_10/jre/bin/java -jar '<https://integration.onehippo.com/job/Repository%20Integration%20Trunk/ws/test/target/surefire/surefirebooter5816505753547686747.jar'> '<https://integration.onehippo.com/job/Repository%20Integration%20Trunk/ws/test/target/surefire/surefire1301399964798615457tmp'> '<https://integration.onehippo.com/job/Repository%20Integration%20Trunk/ws/test/target/surefire/surefire_17480997183653862167tmp'>
	at org.apache.maven.plugin.surefire.booterclient.ForkStarter.fork(ForkStarter.java:485)
	at org.apache.maven.plugin.surefire.booterclient.ForkStarter.fork(ForkStarter.java:352)
	at org.apache.maven.plugin.surefire.booterclient.ForkStarter.run(ForkStarter.java:158)
	at org.apache.maven.plugin.surefire.AbstractSurefireMojo.executeProvider(AbstractSurefireMojo.java:958)
	at org.apache.maven.plugin.surefire.AbstractSurefireMojo.executeAfterPreconditionsChecked(AbstractSurefireMojo.java:822)
	at org.apache.maven.plugin.surefire.AbstractSurefireMojo.execute(AbstractSurefireMojo.java:720)
	at org.apache.maven.plugin.DefaultBuildPluginManager.executeMojo(DefaultBuildPluginManager.java:101)
	... 20 more
[ERROR] 
[ERROR] Re-run Maven using the -X switch to enable full debug logging.
[ERROR] 
[ERROR] For more information about the errors and possible solutions, please read the following articles:
[ERROR] [Help 1] http://cwiki.apache.org/confluence/display/MAVEN/PluginExecutionException
[ERROR] 
[ERROR] After correcting the problems, you can resume the build with the command
[ERROR]   mvn <goals> -rf :hippo-repository-test
[DEBUG] Waiting for process to finish
[DEBUG] Result: 1

--
This message is automatically generated by Hudson. 
For more information on Hudson, see: http://hudson-ci.org/


More information about the Hippo-cms7-dev mailing list