[Hippo-cms7-dev] [Hudson] Build failed in Hudson: hippo-cms7-archetype Trunk #823

Hippo Public Hudson Server beheer at onehippo.com
Mon Sep 9 05:38:53 CEST 2013


See <https://builds.onehippo.org/job/hippo-cms7-archetype%20Trunk/823/>

------------------------------------------
[...truncated 356 lines...]
     [java] 8/40 KB   17/30 KB   16/40 KB   17/30 KB   Downloading: http://repo.maven.apache.org/maven2/org/apache/maven/scm/maven-scm-provider-clearcase/1.8/maven-scm-provider-clearcase-1.8.jar20/40 KB   21/30 KB   
     [java] 20/40 KB   17/30 KB   20/40 KB   23/30 KB   24/40 KB   23/30 KB   24/40 KB   27/30 KB   28/40 KB   27/30 KB   28/40 KB   28/30 KB   32/40 KB   28/30 KB   36/40 KB   28/30 KB   36/40 KB   30/30 KB   40/40 KB   30/30 KB                         Downloaded: http://repo.maven.apache.org/maven2/org/apache/maven/scm/maven-scm-provider-cvsexe/1.8/maven-scm-provider-cvsexe-1.8.jar (30 KB at 1456.8 KB/sec)Downloading: http://repo.maven.apache.org/maven2/org/apache/maven/scm/maven-scm-provider-perforce/1.8/maven-scm-provider-perforce-1.8.jar
     [java] 40/40 KB   4/73 KB    
     [java] 40/40 KB   8/73 KB   40/40 KB   12/73 KB   40/40 KB   16/73 KB   40/40 KB   20/73 KB   40/40 KB   24/73 KB   40/40 KB   28/73 KB   40/40 KB   32/73 KB   40/40 KB   33/73 KB   40/40 KB   37/73 KB   40/40 KB   38/73 KB   40/40 KB   38/73 KB   4/79 KB   40/40 KB   38/73 KB   8/79 KB   40/40 KB   38/73 KB   10/79 KB   40/40 KB   40/73 KB   10/79 KB   40/40 KB   40/73 KB   14/79 KB   40/40 KB   40/73 KB   16/79 KB   40/40 KB   40/73 KB   20/79 KB   40/40 KB   40/73 KB   21/79 KB   40/40 KB   40/73 KB   23/79 KB   40/40 KB   44/73 KB   23/79 KB   40/40 KB   44/73 KB   23/79 KB   40/40 KB   48/73 KB   23/79 KB   40/40 KB   50/73 KB   23/79 KB   40/40 KB   54/73 KB   23/79 KB   40/40 KB   55/73 KB   23/79 KB   40/40 KB   59/73 KB   23/79 KB   40/40 KB   61/73 KB   23/79 KB   40/40 KB   65/73 KB   23/79 KB   40/40 KB   67/73 KB   23/79 KB   40/40 KB   69/73 KB   23/79 KB   40/40 KB   73/73 KB   23/79 KB                                    Downloaded: http://repo.maven.apache.org/maven2/org/apache/maven/scm/maven-scm-provider-svn-commons/1.8/maven-scm-provider-svn-commons-1.8.jar (40 KB at 1097.2 KB/sec)Downloading: http://repo.maven.apache.org/maven2/org/apache/maven/scm/maven-scm-provider-hg/1.8/maven-scm-provider-hg-1.8.jar
     [java] 73/73 KB   4/70 KB   23/79 KB    
     [java] 73/73 KB   23/79 KB   8/70 KB   73/73 KB   23/79 KB   12/70 KB   73/73 KB   23/79 KB   16/70 KB   73/73 KB   23/79 KB   20/70 KB   73/73 KB   23/79 KB   24/70 KB   73/73 KB   23/79 KB   28/70 KB   73/73 KB   23/79 KB   32/70 KB   73/73 KB   23/79 KB   36/70 KB   73/73 KB   23/79 KB   40/70 KB   73/73 KB   23/79 KB   41/70 KB   73/73 KB   24/79 KB   41/70 KB   73/73 KB   24/79 KB   45/70 KB   73/73 KB   24/79 KB   45/70 KB   73/73 KB   28/79 KB   45/70 KB   73/73 KB   30/79 KB   45/70 KB   73/73 KB   34/79 KB   45/70 KB   73/73 KB   35/79 KB   45/70 KB   73/73 KB   39/79 KB   45/70 KB   73/73 KB   41/79 KB   45/70 KB   73/73 KB   44/79 KB   45/70 KB   4/80 KB   73/73 KB   44/79 KB   45/70 KB   8/80 KB   73/73 KB   44/79 KB   45/70 KB   10/80 KB   73/73 KB   44/79 KB   45/70 KB   10/80 KB   73/73 KB   45/79 KB   45/70 KB   14/80 KB   73/73 KB   45/79 KB   45/70 KB   16/80 KB   73/73 KB   45/79 KB   45/70 KB   20/80 KB   73/73 KB   45/79 KB   45/70 KB   21/80 KB   73/73 KB   45/79 KB   45/70 KB   25/80 KB   73/73 KB   45/79 KB   45/70 KB   27/80 KB   73/73 KB   45/79 KB   45/70 KB   28/80 KB   73/73 KB   45/79 KB   45/70 KB   28/80 KB   73/73 KB   45/79 KB   49/70 KB   28/80 KB   73/73 KB   45/79 KB   50/70 KB   28/80 KB   73/73 KB   45/79 KB   54/70 KB   28/80 KB   73/73 KB   45/79 KB   58/70 KB   28/80 KB   73/73 KB   45/79 KB   61/70 KB   28/80 KB   73/73 KB   45/79 KB   65/70 KB   28/80 KB   73/73 KB   45/79 KB   68/70 KB   28/80 KB   73/73 KB   49/79 KB   68/70 KB   28/80 KB   73/73 KB   50/79 KB   68/70 KB   28/80 KB   73/73 KB   50/79 KB   70/70 KB   28/80 KB   73/73 KB   54/79 KB   70/70 KB   28/80 KB   73/73 KB   55/79 KB   70/70 KB   28/80 KB   73/73 KB   59/79 KB   70/70 KB   28/80 KB   73/73 KB   61/79 KB   70/70 KB   28/80 KB   73/73 KB   65/79 KB   70/70 KB   28/80 KB   73/73 KB   67/79 KB   70/70 KB   31/80 KB   73/73 KB   67/79 KB   70/70 KB   31/80 KB   73/73 KB   69/79 KB   70/70 KB   35/80 KB   73/73 KB   69/79 KB   70/70 KB   37/80 KB   73/73 KB   69/79 KB   70/70 KB   41/80 KB   73/73 KB   69/79 KB   70/70 KB   43/80 KB   73/73 KB   69/79 KB   70/70 KB   47/80 KB   73/73 KB   69/79 KB   70/70 KB   48/80 KB   73/73 KB   69/79 KB   70/70 KB                                               Downloaded: http://repo.maven.apache.org/maven2/org/apache/maven/scm/maven-scm-provider-starteam/1.8/maven-scm-provider-starteam-1.8.jar (73 KB at 2268.9 KB/sec)52/80 KB   69/79 KB   70/70 KB              
     [java] 54/80 KB   69/79 KB   70/70 KB   57/80 KB   69/79 KB   70/70 KB   57/80 KB   69/79 KB   70/70 KB   4/65 KB   57/80 KB   72/79 KB   70/70 KB   4/65 KB   57/80 KB   75/79 KB   70/70 KB   4/65 KB   57/80 KB   79/79 KB   70/70 KB   4/65 KB   61/80 KB   79/79 KB   70/70 KB   4/65 KB   62/80 KB   79/79 KB   70/70 KB   4/65 KB   65/80 KB   79/79 KB   70/70 KB   4/65 KB   69/80 KB   79/79 KB   70/70 KB   4/65 KB   72/80 KB   79/79 KB   70/70 KB   4/65 KB   76/80 KB   79/79 KB   70/70 KB   4/65 KB   77/80 KB   79/79 KB   70/70 KB   4/65 KB   77/80 KB   79/79 KB   70/70 KB   8/65 KB   77/80 KB   79/79 KB   70/70 KB   12/65 KB   80/80 KB   79/79 KB   70/70 KB   12/65 KB   80/80 KB   79/79 KB   70/70 KB   16/65 KB   80/80 KB   79/79 KB   70/70 KB   20/65 KB   80/80 KB   79/79 KB   70/70 KB   24/65 KB   80/80 KB   79/79 KB   70/70 KB   28/65 KB   80/80 KB   79/79 KB   32/65 KB              80/80 KB   79/79 KB   36/65 KB   80/80 KB   79/79 KB   40/65 KB   80/80 KB   79/79 KB   44/65 KB   80/80 KB   79/79 KB   48/65 KB   80/80 KB   79/79 KB   52/65 KB   80/80 KB   79/79 KB   56/65 KB   80/80 KB   79/79 KB   60/65 KB   80/80 KB   79/79 KB   64/65 KB   80/80 KB   79/79 KB   65/65 KB                                               Downloaded: http://repo.maven.apache.org/maven2/org/apache/maven/scm/maven-scm-provider-clearcase/1.8/maven-scm-provider-clearcase-1.8.jar (70 KB at 1735.5 KB/sec)                                 
     [java] Downloaded: http://repo.maven.apache.org/maven2/org/apache/maven/scm/maven-scm-provider-cvs-commons/1.8/maven-scm-provider-cvs-commons-1.8.jar (79 KB at 1772.9 KB/sec)                                 
     [java] Downloaded: http://repo.maven.apache.org/maven2/org/apache/maven/scm/maven-scm-provider-perforce/1.8/maven-scm-provider-perforce-1.8.jar (80 KB at 1996.8 KB/sec)                                 
     [java] Downloaded: http://repo.maven.apache.org/maven2/org/apache/maven/scm/maven-scm-provider-hg/1.8/maven-scm-provider-hg-1.8.jar (65 KB at 1793.2 KB/sec)[INFO] Checking for local modifications: skipped.
     [java] [INFO] Updating project files from SCM: skipped.
     [java] [INFO] Executing: /bin/sh -c cd "<https://builds.onehippo.org/job/hippo-cms7-archetype%20Trunk/ws/website/target/gettingstarted"> && svn --non-interactive info
     [java] [INFO] Working directory: <https://builds.onehippo.org/job/hippo-cms7-archetype%20Trunk/ws/website/target/gettingstarted>
     [java] [INFO] Storing buildNumber: -1 at timestamp: 1378697928301
     [java] [INFO] Executing: /bin/sh -c cd "<https://builds.onehippo.org/job/hippo-cms7-archetype%20Trunk/ws/website/target/gettingstarted"> && svn --non-interactive info
     [java] [INFO] Working directory: <https://builds.onehippo.org/job/hippo-cms7-archetype%20Trunk/ws/website/target/gettingstarted>
     [java] [INFO] Storing buildScmBranch: UNKNOWN_BRANCH
     [java] [INFO] 
     [java] [INFO] --- maven-remote-resources-plugin:1.4:process (default) @ gettingstarted ---
     [java] [INFO] 
     [java] [INFO] --- maven-source-plugin:2.2.1:jar-no-fork (attach-sources) @ gettingstarted ---
     [java] [INFO] 
     [java] [INFO] --- maven-install-plugin:2.3.1:install (default-install) @ gettingstarted ---
     [java] [INFO] Installing <https://builds.onehippo.org/job/hippo-cms7-archetype%20Trunk/ws/website/target/gettingstarted/pom.xml> to /var/hudson-data/repository/m2/org/onehippo/cms7/hst/gettingstarted/1.01.00/gettingstarted-1.01.00.pom
     [java] [INFO]                                                                         
     [java] [INFO] ------------------------------------------------------------------------
     [java] [INFO] Building Getting Started Bootstrap 1.01.00
     [java] [INFO] ------------------------------------------------------------------------
     [java] [INFO] 
     [java] [INFO] --- buildnumber-maven-plugin:1.2:create (default) @ gettingstarted-bootstrap ---
     [java] [INFO] Checking for local modifications: skipped.
     [java] [INFO] Updating project files from SCM: skipped.
     [java] [INFO] Executing: /bin/sh -c cd "<https://builds.onehippo.org/job/hippo-cms7-archetype%20Trunk/ws/website/target/gettingstarted/bootstrap"> && svn --non-interactive info
     [java] [INFO] Working directory: <https://builds.onehippo.org/job/hippo-cms7-archetype%20Trunk/ws/website/target/gettingstarted/bootstrap>
     [java] [INFO] Storing buildNumber: -1 at timestamp: 1378697929217
     [java] [INFO] Executing: /bin/sh -c cd "<https://builds.onehippo.org/job/hippo-cms7-archetype%20Trunk/ws/website/target/gettingstarted/bootstrap"> && svn --non-interactive info
     [java] [INFO] Working directory: <https://builds.onehippo.org/job/hippo-cms7-archetype%20Trunk/ws/website/target/gettingstarted/bootstrap>
     [java] [INFO] Storing buildScmBranch: UNKNOWN_BRANCH
     [java] [INFO] 
     [java] [INFO] --- maven-remote-resources-plugin:1.4:process (default) @ gettingstarted-bootstrap ---
     [java] [INFO] 
     [java] [INFO] --- maven-source-plugin:2.2.1:jar-no-fork (attach-sources) @ gettingstarted-bootstrap ---
     [java] [INFO] 
     [java] [INFO] --- maven-install-plugin:2.3.1:install (default-install) @ gettingstarted-bootstrap ---
     [java] [INFO] Installing <https://builds.onehippo.org/job/hippo-cms7-archetype%20Trunk/ws/website/target/gettingstarted/bootstrap/pom.xml> to /var/hudson-data/repository/m2/org/onehippo/cms7/hst/gettingstarted-bootstrap/1.01.00/gettingstarted-bootstrap-1.01.00.pom
     [java] [INFO]                                                                         
     [java] [INFO] ------------------------------------------------------------------------
     [java] [INFO] Building Getting Started Bootstrap Configuration 1.01.00
     [java] [INFO] ------------------------------------------------------------------------
     [java] [INFO] 
     [java] [INFO] --- buildnumber-maven-plugin:1.2:create (default) @ gettingstarted-bootstrap-configuration ---
     [java] [INFO] Checking for local modifications: skipped.
     [java] [INFO] Updating project files from SCM: skipped.
     [java] [INFO] Executing: /bin/sh -c cd "<https://builds.onehippo.org/job/hippo-cms7-archetype%20Trunk/ws/website/target/gettingstarted/bootstrap/configuration"> && svn --non-interactive info
     [java] [INFO] Working directory: <https://builds.onehippo.org/job/hippo-cms7-archetype%20Trunk/ws/website/target/gettingstarted/bootstrap/configuration>
     [java] [INFO] Storing buildNumber: -1 at timestamp: 1378697929509
     [java] [INFO] Executing: /bin/sh -c cd "<https://builds.onehippo.org/job/hippo-cms7-archetype%20Trunk/ws/website/target/gettingstarted/bootstrap/configuration"> && svn --non-interactive info
     [java] [INFO] Working directory: <https://builds.onehippo.org/job/hippo-cms7-archetype%20Trunk/ws/website/target/gettingstarted/bootstrap/configuration>
     [java] [INFO] Storing buildScmBranch: UNKNOWN_BRANCH
     [java] [INFO] 
     [java] [INFO] --- maven-remote-resources-plugin:1.4:process (default) @ gettingstarted-bootstrap-configuration ---
     [java] [INFO] 
     [java] [INFO] --- maven-resources-plugin:2.6:resources (default-resources) @ gettingstarted-bootstrap-configuration ---
     [java] [INFO] Using 'UTF-8' encoding to copy filtered resources.
     [java] [INFO] Copying 57 resources
     [java] [INFO] 
     [java] [INFO] --- maven-compiler-plugin:2.5.1:compile (default-compile) @ gettingstarted-bootstrap-configuration ---
     [java] [INFO] No sources to compile
     [java] [INFO] 
     [java] [INFO] --- maven-resources-plugin:2.6:testResources (default-testResources) @ gettingstarted-bootstrap-configuration ---
     [java] [INFO] Using 'UTF-8' encoding to copy filtered resources.
     [java] [INFO] skip non existing resourceDirectory <https://builds.onehippo.org/job/hippo-cms7-archetype%20Trunk/ws/website/target/gettingstarted/bootstrap/configuration/src/test/resources>
     [java] [INFO] 
     [java] [INFO] --- maven-compiler-plugin:2.5.1:testCompile (default-testCompile) @ gettingstarted-bootstrap-configuration ---
     [java] [INFO] No sources to compile
     [java] [INFO] 
     [java] [INFO] --- maven-surefire-plugin:2.12.4:test (default-test) @ gettingstarted-bootstrap-configuration ---
     [java] [INFO] No tests to run.
     [java] [INFO] 
     [java] [INFO] --- maven-jar-plugin:2.4:jar (default-jar) @ gettingstarted-bootstrap-configuration ---
     [java] [INFO] Building jar: <https://builds.onehippo.org/job/hippo-cms7-archetype%20Trunk/ws/website/target/gettingstarted/bootstrap/configuration/target/gettingstarted-bootstrap-configuration-1.01.00.jar>
     [java] [INFO] 
     [java] [INFO] --- maven-source-plugin:2.2.1:jar-no-fork (attach-sources) @ gettingstarted-bootstrap-configuration ---
     [java] [INFO] Building jar: <https://builds.onehippo.org/job/hippo-cms7-archetype%20Trunk/ws/website/target/gettingstarted/bootstrap/configuration/target/gettingstarted-bootstrap-configuration-1.01.00-sources.jar>
     [java] [INFO] 
     [java] [INFO] --- maven-install-plugin:2.3.1:install (default-install) @ gettingstarted-bootstrap-configuration ---
     [java] [INFO] Installing <https://builds.onehippo.org/job/hippo-cms7-archetype%20Trunk/ws/website/target/gettingstarted/bootstrap/configuration/target/gettingstarted-bootstrap-configuration-1.01.00.jar> to /var/hudson-data/repository/m2/org/onehippo/cms7/hst/gettingstarted-bootstrap-configuration/1.01.00/gettingstarted-bootstrap-configuration-1.01.00.jar
     [java] [INFO] Installing <https://builds.onehippo.org/job/hippo-cms7-archetype%20Trunk/ws/website/target/gettingstarted/bootstrap/configuration/pom.xml> to /var/hudson-data/repository/m2/org/onehippo/cms7/hst/gettingstarted-bootstrap-configuration/1.01.00/gettingstarted-bootstrap-configuration-1.01.00.pom
     [java] [INFO] Installing <https://builds.onehippo.org/job/hippo-cms7-archetype%20Trunk/ws/website/target/gettingstarted/bootstrap/configuration/target/gettingstarted-bootstrap-configuration-1.01.00-sources.jar> to /var/hudson-data/repository/m2/org/onehippo/cms7/hst/gettingstarted-bootstrap-configuration/1.01.00/gettingstarted-bootstrap-configuration-1.01.00-sources.jar
     [java] [INFO]                                                                         
     [java] [INFO] ------------------------------------------------------------------------
     [java] [INFO] Building Getting Started Bootstrap Content 1.01.00
     [java] [INFO] ------------------------------------------------------------------------
     [java] [INFO] 
     [java] [INFO] --- buildnumber-maven-plugin:1.2:create (default) @ gettingstarted-bootstrap-content ---
     [java] [INFO] Checking for local modifications: skipped.
     [java] [INFO] Updating project files from SCM: skipped.
     [java] [INFO] Executing: /bin/sh -c cd "<https://builds.onehippo.org/job/hippo-cms7-archetype%20Trunk/ws/website/target/gettingstarted/bootstrap/content"> && svn --non-interactive info
     [java] [INFO] Working directory: <https://builds.onehippo.org/job/hippo-cms7-archetype%20Trunk/ws/website/target/gettingstarted/bootstrap/content>
     [java] [INFO] Storing buildNumber: -1 at timestamp: 1378697930449
     [java] [INFO] Executing: /bin/sh -c cd "<https://builds.onehippo.org/job/hippo-cms7-archetype%20Trunk/ws/website/target/gettingstarted/bootstrap/content"> && svn --non-interactive info
     [java] [INFO] Working directory: <https://builds.onehippo.org/job/hippo-cms7-archetype%20Trunk/ws/website/target/gettingstarted/bootstrap/content>
     [java] [INFO] Storing buildScmBranch: UNKNOWN_BRANCH
     [java] [INFO] 
     [java] [INFO] --- maven-remote-resources-plugin:1.4:process (default) @ gettingstarted-bootstrap-content ---
     [java] [INFO] 
     [java] [INFO] --- maven-resources-plugin:2.6:resources (default-resources) @ gettingstarted-bootstrap-content ---
     [java] [INFO] Using 'UTF-8' encoding to copy filtered resources.
     [java] [INFO] Copying 6 resources
     [java] [INFO] 
     [java] [INFO] --- maven-compiler-plugin:2.5.1:compile (default-compile) @ gettingstarted-bootstrap-content ---
     [java] [INFO] No sources to compile
     [java] [INFO] 
     [java] [INFO] --- maven-resources-plugin:2.6:testResources (default-testResources) @ gettingstarted-bootstrap-content ---
     [java] [INFO] Using 'UTF-8' encoding to copy filtered resources.
     [java] [INFO] skip non existing resourceDirectory <https://builds.onehippo.org/job/hippo-cms7-archetype%20Trunk/ws/website/target/gettingstarted/bootstrap/content/src/test/resources>
     [java] [INFO] 
     [java] [INFO] --- maven-compiler-plugin:2.5.1:testCompile (default-testCompile) @ gettingstarted-bootstrap-content ---
     [java] [INFO] No sources to compile
     [java] [INFO] 
     [java] [INFO] --- maven-surefire-plugin:2.12.4:test (default-test) @ gettingstarted-bootstrap-content ---
     [java] [INFO] No tests to run.
     [java] [INFO] 
     [java] [INFO] --- maven-jar-plugin:2.4:jar (default-jar) @ gettingstarted-bootstrap-content ---
     [java] [INFO] Building jar: <https://builds.onehippo.org/job/hippo-cms7-archetype%20Trunk/ws/website/target/gettingstarted/bootstrap/content/target/gettingstarted-bootstrap-content-1.01.00.jar>
     [java] [INFO] 
     [java] [INFO] --- maven-source-plugin:2.2.1:jar-no-fork (attach-sources) @ gettingstarted-bootstrap-content ---
     [java] [INFO] Building jar: <https://builds.onehippo.org/job/hippo-cms7-archetype%20Trunk/ws/website/target/gettingstarted/bootstrap/content/target/gettingstarted-bootstrap-content-1.01.00-sources.jar>
     [java] [INFO] 
     [java] [INFO] --- maven-install-plugin:2.3.1:install (default-install) @ gettingstarted-bootstrap-content ---
     [java] [INFO] Installing <https://builds.onehippo.org/job/hippo-cms7-archetype%20Trunk/ws/website/target/gettingstarted/bootstrap/content/target/gettingstarted-bootstrap-content-1.01.00.jar> to /var/hudson-data/repository/m2/org/onehippo/cms7/hst/gettingstarted-bootstrap-content/1.01.00/gettingstarted-bootstrap-content-1.01.00.jar
     [java] [INFO] Installing <https://builds.onehippo.org/job/hippo-cms7-archetype%20Trunk/ws/website/target/gettingstarted/bootstrap/content/pom.xml> to /var/hudson-data/repository/m2/org/onehippo/cms7/hst/gettingstarted-bootstrap-content/1.01.00/gettingstarted-bootstrap-content-1.01.00.pom
     [java] [INFO] Installing <https://builds.onehippo.org/job/hippo-cms7-archetype%20Trunk/ws/website/target/gettingstarted/bootstrap/content/target/gettingstarted-bootstrap-content-1.01.00-sources.jar> to /var/hudson-data/repository/m2/org/onehippo/cms7/hst/gettingstarted-bootstrap-content/1.01.00/gettingstarted-bootstrap-content-1.01.00-sources.jar
     [java] [INFO]                                                                         
     [java] [INFO] ------------------------------------------------------------------------
     [java] [INFO] Building Getting Started CMS 1.01.00
     [java] [INFO] ------------------------------------------------------------------------
     [java] Downloading: http://maven.onehippo.com/maven2/com/googlecode/mavenfilesync/maven-filesync-plugin/1.0.0/maven-filesync-plugin-1.0.0.pom
     [java]                                  
     [java] Downloading: http://repo.maven.apache.org/maven2/com/googlecode/mavenfilesync/maven-filesync-plugin/1.0.0/maven-filesync-plugin-1.0.0.pom4/5 KB                           
     [java] 5/5 KB            Downloaded: http://repo.maven.apache.org/maven2/com/googlecode/mavenfilesync/maven-filesync-plugin/1.0.0/maven-filesync-plugin-1.0.0.pom (5 KB at 408.8 KB/sec)Downloading: http://maven.onehippo.com/maven2/com/googlecode/mavenfilesync/maven-filesync-plugin/1.0.0/maven-filesync-plugin-1.0.0.jar
     [java]          
     [java] Downloading: http://repo.maven.apache.org/maven2/com/googlecode/mavenfilesync/maven-filesync-plugin/1.0.0/maven-filesync-plugin-1.0.0.jar3/13 KB   
     [java] 6/13 KB   9/13 KB   13/13 KB   13/13 KB              Downloaded: http://repo.maven.apache.org/maven2/com/googlecode/mavenfilesync/maven-filesync-plugin/1.0.0/maven-filesync-plugin-1.0.0.jar (13 KB at 789.7 KB/sec)Downloading: http://maven.onehippo.com/maven2-snapshots/org/onehippo/cms7/hst/dependencies/2.27.02-SNAPSHOT/dependencies-2.27.02-20130909.030618-43.pom
     [java] 2/2 KB     
     [java]          Downloaded: http://maven.onehippo.com/maven2-snapshots/org/onehippo/cms7/hst/dependencies/2.27.02-SNAPSHOT/dependencies-2.27.02-20130909.030618-43.pom (2 KB at 20.3 KB/sec)Downloading: http://maven.onehippo.com/maven2-snapshots/org/onehippo/cms7/hippo-packages/2.25.01-SNAPSHOT/hippo-packages-2.25.01-20130909.033631-44.pom
     [java] 4/4 KB   
     [java]          Downloaded: http://maven.onehippo.com/maven2-snapshots/org/onehippo/cms7/hippo-packages/2.25.01-SNAPSHOT/hippo-packages-2.25.01-20130909.033631-44.pom (4 KB at 42.7 KB/sec)Downloading: http://maven.onehippo.com/maven2-snapshots/org/onehippo/cms7/hippo-services-eventbus/1.03.03-SNAPSHOT/hippo-services-eventbus-1.03.03-20130909.021655-18.pom
     [java] 4/4 KB   
     [java]          Downloaded: http://maven.onehippo.com/maven2-snapshots/org/onehippo/cms7/hippo-services-eventbus/1.03.03-SNAPSHOT/hippo-services-eventbus-1.03.03-20130909.021655-18.pom (4 KB at 55.3 KB/sec)Downloading: http://maven.onehippo.com/maven2/org/onehippo/addon/frontend/gallerypicker/gallerypicker/1.12.00-SNAPSHOT/maven-metadata.xml
     [java] Downloading: http://maven.onehippo.com/maven2-snapshots/org/onehippo/addon/frontend/gallerypicker/gallerypicker/1.12.00-SNAPSHOT/maven-metadata.xml
     [java]          
     [java]          Downloading: http://maven.onehippo.com/maven2-snapshots/org/onehippo/addon/frontend/gallerypicker/gallerypicker/1.12.00-SNAPSHOT/gallerypicker-1.12.00-SNAPSHOT.pom         
     [java] Downloading: http://maven.onehippo.com/maven2/org/onehippo/addon/frontend/gallerypicker/gallerypicker/1.12.00-SNAPSHOT/gallerypicker-1.12.00-SNAPSHOT.pom         
     [java] [WARNING] The POM for org.onehippo.addon.frontend.gallerypicker:gallerypicker:jar:1.12.00-SNAPSHOT is missing, no dependency information availableDownloading: http://maven.onehippo.com/maven2-snapshots/org/onehippo/cms7/hippo-services-eventbus/1.03.03-SNAPSHOT/hippo-services-eventbus-1.03.03-20130909.021655-18.jar
     [java] Downloading: http://maven.onehippo.com/maven2-snapshots/org/onehippo/addon/frontend/gallerypicker/gallerypicker/1.12.00-SNAPSHOT/gallerypicker-1.12.00-SNAPSHOT.jar
     [java] 4/15 KB   
     [java] 8/15 KB   12/15 KB   15/15 KB                         Downloaded: http://maven.onehippo.com/maven2-snapshots/org/onehippo/cms7/hippo-services-eventbus/1.03.03-SNAPSHOT/hippo-services-eventbus-1.03.03-20130909.021655-18.jar (15 KB at 186.0 KB/sec)Downloading: http://maven.onehippo.com/maven2/org/onehippo/addon/frontend/gallerypicker/gallerypicker/1.12.00-SNAPSHOT/gallerypicker-1.12.00-SNAPSHOT.jar
     [java]            
     [java] [INFO] ------------------------------------------------------------------------[INFO] Reactor Summary:
     [java] [INFO] 
     [java] [INFO] Getting Started ................................... SUCCESS [3.360s]
     [java] [INFO] Getting Started Bootstrap ......................... SUCCESS [0.188s]
     [java] [INFO] Getting Started Bootstrap Configuration ........... SUCCESS [1.036s]
     [java] [INFO] Getting Started Bootstrap Content ................. SUCCESS [0.280s]
     [java] [INFO] Getting Started CMS ............................... FAILURE [1.684s]
     [java] [INFO] Getting Started Site .............................. SKIPPED
     [java] [INFO] ------------------------------------------------------------------------
     [java] [INFO] BUILD FAILURE
     [java] [INFO] ------------------------------------------------------------------------
     [java] [INFO] Total time: 7.332s
     [java] [INFO] Finished at: Mon Sep 09 05:38:52 CEST 2013
     [java] [INFO] Final Memory: 16M/38M
     [java] [INFO] ------------------------------------------------------------------------
     [java] [ERROR] Failed to execute goal on project gettingstarted-cms: Could not resolve dependencies for project org.onehippo.cms7.hst:gettingstarted-cms:war:1.01.00: Could not find artifact org.onehippo.addon.frontend.gallerypicker:gallerypicker:jar:1.12.00-SNAPSHOT in hippo-maven2-snapshots (http://maven.onehippo.com/maven2-snapshots/) -> [Help 1]
     [java] [ERROR] 
     [java] [ERROR] To see the full stack trace of the errors, re-run Maven with the -e switch.
     [java] [ERROR] Re-run Maven using the -X switch to enable full debug logging.
     [java] [ERROR] 
     [java] [ERROR] For more information about the errors and possible solutions, please read the following articles:
     [java] [ERROR] [Help 1] http://cwiki.apache.org/confluence/display/MAVEN/DependencyResolutionException
     [java] [ERROR] 
     [java] [ERROR] After correcting the problems, you can resume the build with the command
     [java] [ERROR]   mvn <goals> -rf :gettingstarted-cms
mojoFailed org.apache.maven.plugins:maven-antrun-plugin:1.2(generate-and-install-gettingstarted)
projectFailed org.onehippo.cms7:hippo-archetype-website:1.08.00-SNAPSHOT
[HUDSON] Archiving <https://builds.onehippo.org/job/hippo-cms7-archetype%20Trunk/ws/website/pom.xml> to /var/hudson-data/jobs/hippo-cms7-archetype Trunk/modules/org.onehippo.cms7$hippo-archetype-website/builds/2013-09-09_05-38-28/archive/org.onehippo.cms7/hippo-archetype-website/1.08.00-SNAPSHOT/pom.xml
[HUDSON] Archiving <https://builds.onehippo.org/job/hippo-cms7-archetype%20Trunk/ws/website/target/hippo-archetype-website-1.08.00-SNAPSHOT.jar> to /var/hudson-data/jobs/hippo-cms7-archetype Trunk/modules/org.onehippo.cms7$hippo-archetype-website/builds/2013-09-09_05-38-28/archive/org.onehippo.cms7/hippo-archetype-website/1.08.00-SNAPSHOT/hippo-archetype-website-1.08.00-SNAPSHOT.jar
[HUDSON] Archiving <https://builds.onehippo.org/job/hippo-cms7-archetype%20Trunk/ws/website/target/hippo-archetype-website-1.08.00-SNAPSHOT-sources.jar> to /var/hudson-data/jobs/hippo-cms7-archetype Trunk/modules/org.onehippo.cms7$hippo-archetype-website/builds/2013-09-09_05-38-28/archive/org.onehippo.cms7/hippo-archetype-website/1.08.00-SNAPSHOT/hippo-archetype-website-1.08.00-SNAPSHOT-sources.jar
sessionEnded
[INFO] ------------------------------------------------------------------------
[INFO] Reactor Summary:
[INFO] 
[INFO] Hippo CMS7 Site Toolkit Maven Archetypes .......... SUCCESS [2.824s]
[INFO] Hippo CMS7 Site Toolkit Website Archetype ......... FAILURE [16.108s]
[INFO] ------------------------------------------------------------------------
[INFO] BUILD FAILURE
[INFO] ------------------------------------------------------------------------
[INFO] Total time: 22.144s
[INFO] Finished at: Mon Sep 09 05:38:52 CEST 2013
[INFO] Final Memory: 14M/35M
[INFO] ------------------------------------------------------------------------
maven builder waiting
mavenExecutionResult exceptions not empty
org.apache.maven.lifecycle.LifecycleExecutionException: Failed to execute goal org.apache.maven.plugins:maven-antrun-plugin:1.2:run (generate-and-install-gettingstarted) on project hippo-archetype-website: An Ant BuildException has occured: Java returned: 1
	at org.apache.maven.lifecycle.internal.MojoExecutor.execute(MojoExecutor.java:217)
	at org.apache.maven.lifecycle.internal.MojoExecutor.execute(MojoExecutor.java:153)
	at org.apache.maven.lifecycle.internal.MojoExecutor.execute(MojoExecutor.java:145)
	at org.apache.maven.lifecycle.internal.LifecycleModuleBuilder.buildProject(LifecycleModuleBuilder.java:84)
	at org.apache.maven.lifecycle.internal.LifecycleModuleBuilder.buildProject(LifecycleModuleBuilder.java:59)
	at org.apache.maven.lifecycle.internal.LifecycleStarter.singleThreadedBuild(LifecycleStarter.java:183)
	at org.apache.maven.lifecycle.internal.LifecycleStarter.execute(LifecycleStarter.java:161)
	at org.apache.maven.DefaultMaven.doExecute(DefaultMaven.java:320)
	at org.apache.maven.DefaultMaven.execute(DefaultMaven.java:156)
	at org.jvnet.hudson.maven3.launcher.Maven3Launcher.main(Maven3Launcher.java:79)
	at sun.reflect.NativeMethodAccessorImpl.invoke0(Native Method)
	at sun.reflect.NativeMethodAccessorImpl.invoke(NativeMethodAccessorImpl.java:39)
	at sun.reflect.DelegatingMethodAccessorImpl.invoke(DelegatingMethodAccessorImpl.java:25)
	at java.lang.reflect.Method.invoke(Method.java:597)
	at org.codehaus.plexus.classworlds.launcher.Launcher.launchStandard(Launcher.java:329)
	at org.codehaus.plexus.classworlds.launcher.Launcher.launch(Launcher.java:239)
	at org.jvnet.hudson.maven3.agent.Maven3Main.launch(Maven3Main.java:146)
	at hudson.maven.Maven3Builder.call(Maven3Builder.java:124)
	at hudson.maven.Maven3Builder.call(Maven3Builder.java:71)
	at hudson.remoting.UserRequest.perform(UserRequest.java:107)
	at hudson.remoting.UserRequest.perform(UserRequest.java:41)
	at hudson.remoting.Request$2.run(Request.java:276)
	at java.util.concurrent.Executors$RunnableAdapter.call(Executors.java:441)
	at java.util.concurrent.FutureTask$Sync.innerRun(FutureTask.java:303)
	at java.util.concurrent.FutureTask.run(FutureTask.java:138)
	at java.util.concurrent.ThreadPoolExecutor$Worker.runTask(ThreadPoolExecutor.java:886)
	at java.util.concurrent.ThreadPoolExecutor$Worker.run(ThreadPoolExecutor.java:908)
	at java.lang.Thread.run(Thread.java:662)
Caused by: org.apache.maven.plugin.MojoExecutionException: An Ant BuildException has occured: Java returned: 1
	at org.apache.maven.plugin.antrun.AbstractAntMojo.executeTasks(AbstractAntMojo.java:131)
	at org.apache.maven.plugin.antrun.AntRunMojo.execute(AntRunMojo.java:98)
	at org.apache.maven.plugin.DefaultBuildPluginManager.executeMojo(DefaultBuildPluginManager.java:101)
	at org.apache.maven.lifecycle.internal.MojoExecutor.execute(MojoExecutor.java:209)
	... 27 more
Caused by: Java returned: 1
	at org.apache.tools.ant.taskdefs.Java.execute(Java.java:87)
	at org.apache.tools.ant.UnknownElement.execute(UnknownElement.java:275)
	at org.apache.tools.ant.Task.perform(Task.java:364)
	at org.apache.tools.ant.Target.execute(Target.java:341)
	at org.apache.maven.plugin.antrun.AbstractAntMojo.executeTasks(AbstractAntMojo.java:118)
	... 30 more
Sending e-mails to: hippo-cms7-dev at lists.onehippo.org
channel stopped
Skipping sonar analysis due to bad build status FAILURE

--
This message is automatically generated by Hudson. 
For more information on Hudson, see: http://hudson-ci.org/


More information about the Hippo-cms7-dev mailing list