[Hippo-cms7-dev] [Hudson] Build failed in Hudson: hippo-cms-2.22.xx #391

Hippo Public Hudson Server beheer at onehippo.com
Fri Sep 13 15:10:54 CEST 2013


See <https://builds.onehippo.org/job/hippo-cms-2.22.xx/391/changes>

Changes:

[wdanes] CMS7-7221: Backport to 7.7 branch

------------------------------------------
[...truncated 11362 lines...]
[INFO] org/hippoecm/frontend/editor/workflow/where-used-16.png already added, skipping
[INFO] org/hippoecm/frontend/editor/workflow/TemplateEditorWorkflowPlugin_nl.properties already added, skipping
[INFO] org/hippoecm/frontend/editor/workflow/TemplateEditingWorkflowPlugin$OnCloseDialog_fr.properties already added, skipping
[INFO] org/hippoecm/frontend/editor/workflow/EditmodelWorkflowPlugin$CopyModelDialog_de.properties already added, skipping
[INFO] org/hippoecm/frontend/editor/workflow/TemplateEditorWorkflowPlugin_it.properties already added, skipping
[INFO] org/hippoecm/frontend/editor/workflow/CommitTypeWorkflowPlugin_fr.properties already added, skipping
[INFO] org/hippoecm/frontend/editor/workflow/TemplateEditorWorkflowPlugin.properties already added, skipping
[INFO] org/hippoecm/frontend/editor/workflow/NamespaceWorkflowPlugin_fr.properties already added, skipping
[INFO] org/hippoecm/frontend/editor/workflow/NamespaceWorkflowPlugin.properties already added, skipping
[INFO] org/hippoecm/frontend/editor/workflow/TemplateEditingWorkflowPlugin_de.properties already added, skipping
[INFO] org/hippoecm/frontend/editor/workflow/TemplateEditingWorkflowPlugin$OnCloseDialog_de.properties already added, skipping
[INFO] org/hippoecm/frontend/editor/workflow/DefaultWorkflowPlugin$RenameDocumentDialog.properties already added, skipping
[INFO] org/hippoecm/frontend/editor/workflow/CommitTypeWorkflowPlugin_de.properties already added, skipping
[INFO] org/hippoecm/frontend/editor/workflow/NamespaceWorkflowPlugin_de.properties already added, skipping
[INFO] org/hippoecm/frontend/editor/layout/TwoColumn.properties already added, skipping
[INFO] org/hippoecm/frontend/editor/layout/TwoColumn_de.properties already added, skipping
[INFO] org/hippoecm/frontend/editor/layout/TwoColumn.html already added, skipping
[INFO] org/hippoecm/frontend/editor/layout/TwoColumn.layout.xml already added, skipping
[INFO] org/hippoecm/frontend/editor/layout/TwoColumn_fr.properties already added, skipping
[INFO] org/hippoecm/frontend/editor/layout/TwoColumn.png already added, skipping
[INFO] org/hippoecm/frontend/editor/layout/no-layout.png already added, skipping
[INFO] org/hippoecm/frontend/editor/layout/TwoColumn_nl.properties already added, skipping
[INFO] org/hippoecm/frontend/editor/layout/TwoColumn_it.properties already added, skipping
[INFO] org/hippoecm/editor/repository/impl/NamespaceWorkflowImpl_it.properties already added, skipping
[INFO] org/hippoecm/editor/repository/impl/TemplateEditorWorkflowImpl_fr.properties already added, skipping
[INFO] org/hippoecm/editor/repository/impl/TemplateEditorWorkflowImpl_de.properties already added, skipping
[INFO] org/hippoecm/editor/repository/impl/TemplateEditorWorkflowImpl_nl.properties already added, skipping
[INFO] org/hippoecm/editor/repository/impl/NamespaceWorkflowImpl.properties already added, skipping
[INFO] org/hippoecm/editor/repository/impl/EditmodelWorkflowImpl_fr.properties already added, skipping
[INFO] org/hippoecm/editor/repository/impl/EditmodelWorkflowImpl_de.properties already added, skipping
[INFO] org/hippoecm/editor/repository/impl/TemplateEditorWorkflowImpl_it.properties already added, skipping
[INFO] org/hippoecm/editor/repository/impl/EditmodelWorkflowImpl_nl.properties already added, skipping
[INFO] org/hippoecm/editor/repository/impl/EditmodelWorkflowImpl_it.properties already added, skipping
[INFO] org/hippoecm/editor/repository/impl/TemplateEditorWorkflowImpl.properties already added, skipping
[INFO] org/hippoecm/editor/repository/impl/NamespaceWorkflowImpl_fr.properties already added, skipping
[INFO] org/hippoecm/editor/repository/impl/NamespaceWorkflowImpl_de.properties already added, skipping
[INFO] org/hippoecm/editor/repository/impl/NamespaceWorkflowImpl_nl.properties already added, skipping
[INFO] org/hippoecm/editor/repository/impl/EditmodelWorkflowImpl.properties already added, skipping
[INFO] META-INF already added, skipping
[INFO] META-INF/NOTICE already added, skipping
[INFO] META-INF/LICENSE already added, skipping
[INFO] META-INF/DEPENDENCIES already added, skipping
[INFO] 
[INFO] --- maven-source-plugin:2.1.2:jar (attach-sources) @ hippo-cms-editor-frontend ---
[INFO] 
[INFO] --- maven-install-plugin:2.3.1:install (default-install) @ hippo-cms-editor-frontend ---
[INFO] Installing <https://builds.onehippo.org/job/hippo-cms-2.22.xx/ws/editor/frontend/target/hippo-cms-editor-frontend-2.22.18-SNAPSHOT.jar> to /var/hudson-data/repository/m2/org/onehippo/cms7/hippo-cms-editor-frontend/2.22.18-SNAPSHOT/hippo-cms-editor-frontend-2.22.18-SNAPSHOT.jar
[INFO] Installing <https://builds.onehippo.org/job/hippo-cms-2.22.xx/ws/editor/frontend/pom.xml> to /var/hudson-data/repository/m2/org/onehippo/cms7/hippo-cms-editor-frontend/2.22.18-SNAPSHOT/hippo-cms-editor-frontend-2.22.18-SNAPSHOT.pom
[INFO] Installing <https://builds.onehippo.org/job/hippo-cms-2.22.xx/ws/editor/frontend/target/hippo-cms-editor-frontend-2.22.18-SNAPSHOT-sources.jar> to /var/hudson-data/repository/m2/org/onehippo/cms7/hippo-cms-editor-frontend/2.22.18-SNAPSHOT/hippo-cms-editor-frontend-2.22.18-SNAPSHOT-sources.jar
[INFO] 
[INFO] --- maven-deploy-plugin:2.6:deploy (default-deploy) @ hippo-cms-editor-frontend ---
Downloading: https://maven.onehippo.com/content/repositories/snapshots/org/onehippo/cms7/hippo-cms-editor-frontend/2.22.18-SNAPSHOT/maven-metadata.xml
Downloaded: https://maven.onehippo.com/content/repositories/snapshots/org/onehippo/cms7/hippo-cms-editor-frontend/2.22.18-SNAPSHOT/maven-metadata.xml (1018 B at 13.1 KB/sec)
Uploading: https://maven.onehippo.com/content/repositories/snapshots/org/onehippo/cms7/hippo-cms-editor-frontend/2.22.18-SNAPSHOT/hippo-cms-editor-frontend-2.22.18-20130913.131033-18.jar
Sep 13, 2013 3:10:33 PM org.apache.commons.httpclient.auth.AuthChallengeProcessor selectAuthScheme
INFO: basic authentication scheme selected
Sep 13, 2013 3:10:33 PM org.apache.commons.httpclient.auth.AuthChallengeProcessor selectAuthScheme
INFO: basic authentication scheme selected
Sep 13, 2013 3:10:33 PM org.apache.commons.httpclient.auth.AuthChallengeProcessor selectAuthScheme
INFO: basic authentication scheme selected
Uploaded: https://maven.onehippo.com/content/repositories/snapshots/org/onehippo/cms7/hippo-cms-editor-frontend/2.22.18-SNAPSHOT/hippo-cms-editor-frontend-2.22.18-20130913.131033-18.jar (1210 KB at 4513.7 KB/sec)
Uploading: https://maven.onehippo.com/content/repositories/snapshots/org/onehippo/cms7/hippo-cms-editor-frontend/2.22.18-SNAPSHOT/hippo-cms-editor-frontend-2.22.18-20130913.131033-18.pom
Sep 13, 2013 3:10:33 PM org.apache.commons.httpclient.auth.AuthChallengeProcessor selectAuthScheme
INFO: basic authentication scheme selected
Sep 13, 2013 3:10:33 PM org.apache.commons.httpclient.auth.AuthChallengeProcessor selectAuthScheme
INFO: basic authentication scheme selected
Sep 13, 2013 3:10:33 PM org.apache.commons.httpclient.auth.AuthChallengeProcessor selectAuthScheme
INFO: basic authentication scheme selected
Uploaded: https://maven.onehippo.com/content/repositories/snapshots/org/onehippo/cms7/hippo-cms-editor-frontend/2.22.18-SNAPSHOT/hippo-cms-editor-frontend-2.22.18-20130913.131033-18.pom (8 KB at 34.4 KB/sec)
Downloading: https://maven.onehippo.com/content/repositories/snapshots/org/onehippo/cms7/hippo-cms-editor-frontend/maven-metadata.xml
Downloaded: https://maven.onehippo.com/content/repositories/snapshots/org/onehippo/cms7/hippo-cms-editor-frontend/maven-metadata.xml (534 B at 7.2 KB/sec)
Uploading: https://maven.onehippo.com/content/repositories/snapshots/org/onehippo/cms7/hippo-cms-editor-frontend/2.22.18-SNAPSHOT/maven-metadata.xml
Sep 13, 2013 3:10:33 PM org.apache.commons.httpclient.auth.AuthChallengeProcessor selectAuthScheme
INFO: basic authentication scheme selected
Sep 13, 2013 3:10:34 PM org.apache.commons.httpclient.auth.AuthChallengeProcessor selectAuthScheme
INFO: basic authentication scheme selected
Sep 13, 2013 3:10:34 PM org.apache.commons.httpclient.auth.AuthChallengeProcessor selectAuthScheme
INFO: basic authentication scheme selected
Uploaded: https://maven.onehippo.com/content/repositories/snapshots/org/onehippo/cms7/hippo-cms-editor-frontend/2.22.18-SNAPSHOT/maven-metadata.xml (2 KB at 7.6 KB/sec)
Uploading: https://maven.onehippo.com/content/repositories/snapshots/org/onehippo/cms7/hippo-cms-editor-frontend/maven-metadata.xml
Sep 13, 2013 3:10:34 PM org.apache.commons.httpclient.auth.AuthChallengeProcessor selectAuthScheme
INFO: basic authentication scheme selected
Sep 13, 2013 3:10:34 PM org.apache.commons.httpclient.auth.AuthChallengeProcessor selectAuthScheme
INFO: basic authentication scheme selected
Sep 13, 2013 3:10:34 PM org.apache.commons.httpclient.auth.AuthChallengeProcessor selectAuthScheme
INFO: basic authentication scheme selected
Uploaded: https://maven.onehippo.com/content/repositories/snapshots/org/onehippo/cms7/hippo-cms-editor-frontend/maven-metadata.xml (2 KB at 4.4 KB/sec)
Uploading: https://maven.onehippo.com/content/repositories/snapshots/org/onehippo/cms7/hippo-cms-editor-frontend/2.22.18-SNAPSHOT/hippo-cms-editor-frontend-2.22.18-20130913.131033-18-sources.jar
Sep 13, 2013 3:10:34 PM org.apache.commons.httpclient.auth.AuthChallengeProcessor selectAuthScheme
INFO: basic authentication scheme selected
Sep 13, 2013 3:10:34 PM org.apache.commons.httpclient.auth.AuthChallengeProcessor selectAuthScheme
INFO: basic authentication scheme selected
Sep 13, 2013 3:10:34 PM org.apache.commons.httpclient.auth.AuthChallengeProcessor selectAuthScheme
INFO: basic authentication scheme selected
Uploaded: https://maven.onehippo.com/content/repositories/snapshots/org/onehippo/cms7/hippo-cms-editor-frontend/2.22.18-SNAPSHOT/hippo-cms-editor-frontend-2.22.18-20130913.131033-18-sources.jar (660 KB at 2842.5 KB/sec)
Uploading: https://maven.onehippo.com/content/repositories/snapshots/org/onehippo/cms7/hippo-cms-editor-frontend/2.22.18-SNAPSHOT/maven-metadata.xml
Sep 13, 2013 3:10:34 PM org.apache.commons.httpclient.auth.AuthChallengeProcessor selectAuthScheme
INFO: basic authentication scheme selected
Sep 13, 2013 3:10:34 PM org.apache.commons.httpclient.auth.AuthChallengeProcessor selectAuthScheme
INFO: basic authentication scheme selected
Sep 13, 2013 3:10:34 PM org.apache.commons.httpclient.auth.AuthChallengeProcessor selectAuthScheme
INFO: basic authentication scheme selected
Uploaded: https://maven.onehippo.com/content/repositories/snapshots/org/onehippo/cms7/hippo-cms-editor-frontend/2.22.18-SNAPSHOT/maven-metadata.xml (2 KB at 8.6 KB/sec)
projectSucceeded org.onehippo.cms7:hippo-cms-editor-frontend:2.22.18-SNAPSHOT
[HUDSON] Archiving <https://builds.onehippo.org/job/hippo-cms-2.22.xx/ws/editor/frontend/target/hippo-cms-editor-frontend-2.22.18-SNAPSHOT.jar> to /var/hudson-data/jobs/hippo-cms-2.22.xx/modules/org.onehippo.cms7$hippo-cms-editor-frontend/builds/2013-09-13_15-06-44/archive/org.onehippo.cms7/hippo-cms-editor-frontend/2.22.18-20130913.131033-18/hippo-cms-editor-frontend-2.22.18-SNAPSHOT.jar
[HUDSON] Archiving <https://builds.onehippo.org/job/hippo-cms-2.22.xx/ws/editor/frontend/target/hippo-cms-editor-frontend-2.22.18-SNAPSHOT-sources.jar> to /var/hudson-data/jobs/hippo-cms-2.22.xx/modules/org.onehippo.cms7$hippo-cms-editor-frontend/builds/2013-09-13_15-06-44/archive/org.onehippo.cms7/hippo-cms-editor-frontend/2.22.18-20130913.131033-18/hippo-cms-editor-frontend-2.22.18-SNAPSHOT-sources.jar
[INFO]                                                                         
[INFO] ------------------------------------------------------------------------
[INFO] Building CMS Perspectives 2.22.18-SNAPSHOT
[INFO] ------------------------------------------------------------------------
[INFO] 
[INFO] --- maven-clean-plugin:2.4.1:clean (default-clean) @ hippo-cms-perspectives ---
[INFO] Checking for local modifications: skipped.
[INFO] Updating project files from SCM: skipped.
[INFO] Executing: /bin/sh -c cd <https://builds.onehippo.org/job/hippo-cms-2.22.xx/ws/perspectives> && svn --non-interactive info
[INFO] Working directory: <https://builds.onehippo.org/job/hippo-cms-2.22.xx/ws/perspectives>
[INFO] Storing buildNumber: 40820 at timestamp: 1379077836431
[INFO] Executing: /bin/sh -c cd <https://builds.onehippo.org/job/hippo-cms-2.22.xx/ws/perspectives> && svn --non-interactive info
[INFO] Working directory: <https://builds.onehippo.org/job/hippo-cms-2.22.xx/ws/perspectives>
[INFO] Storing buildScmBranch: branches/hippo-cms-2.22.xx/perspectives
[INFO] 
[INFO] --- buildnumber-maven-plugin:1.0:create (default) @ hippo-cms-perspectives ---
[INFO] 
[INFO] --- maven-remote-resources-plugin:1.2.1:process (default) @ hippo-cms-perspectives ---
[INFO] [debug] execute contextualize
[INFO] Using 'UTF-8' encoding to copy filtered resources.
[INFO] Copying 211 resources

[INFO] --- maven-resources-plugin:2.5:resources (default-resources) @ hippo-cms-perspectives ---
[INFO] Copying 2 resources
[INFO] Copying 3 resources
[INFO] 
[INFO] --- maven-compiler-plugin:2.3.2:compile (default-compile) @ hippo-cms-perspectives ---
[INFO] Compiling 113 source files to <https://builds.onehippo.org/job/hippo-cms-2.22.xx/ws/perspectives/target/classes>
[INFO] -------------------------------------------------------------
mojoFailed org.apache.maven.plugins:maven-compiler-plugin:2.3.2(default-compile)[ERROR] COMPILATION ERROR : 
[INFO] -------------------------------------------------------------
[ERROR] <https://builds.onehippo.org/job/hippo-cms-2.22.xx/ws/perspectives/src/main/java/org/hippoecm/frontend/plugins/cms/admin/users/User.java>:[70,58] cannot find symbol
symbol  : variable HIPPO_SYSTEM
location: interface org.hippoecm.repository.api.HippoNodeType
[INFO] 1 error
[INFO] -------------------------------------------------------------

projectFailed org.onehippo.cms7:hippo-cms-perspectives:2.22.18-SNAPSHOT
[HUDSON] Archiving <https://builds.onehippo.org/job/hippo-cms-2.22.xx/ws/perspectives/pom.xml> to /var/hudson-data/jobs/hippo-cms-2.22.xx/modules/org.onehippo.cms7$hippo-cms-perspectives/builds/2013-09-13_15-06-44/archive/org.onehippo.cms7/hippo-cms-perspectives/2.22.18-SNAPSHOT/pom.xml
sessionEnded
[INFO] ------------------------------------------------------------------------
[INFO] Reactor Summary:
[INFO] 
[INFO] CMS ............................................... SUCCESS [6.940s]
[INFO] CMS SSO ........................................... SUCCESS [8.552s]
[INFO] CMS API ........................................... SUCCESS [21.236s]
[INFO] CMS Engine ........................................ SUCCESS [12.160s]
[INFO] CMS Plugins ....................................... SUCCESS [9.176s]
[INFO] CMS Engine Test ................................... SUCCESS [1:31.688s]
[INFO] CMS Workflow ...................................... SUCCESS [15.284s]
[INFO] CMS Translation ................................... SUCCESS [5.148s]
[INFO] CMS Translation Common ............................ SUCCESS [5.456s]
[INFO] CMS Builtin ....................................... SUCCESS [5.144s]
[INFO] CMS Versioning .................................... SUCCESS [4.764s]
[INFO] CMS Goto .......................................... SUCCESS [5.724s]
[INFO] CMS Search ........................................ SUCCESS [4.792s]
[INFO] CMS Editor ........................................ SUCCESS [2.104s]
[INFO] CMS Editor Common ................................. SUCCESS [3.796s]
[INFO] CMS Editor Plugins ................................ SUCCESS [12.444s]
[INFO] CMS Perspectives .................................. FAILURE [5.480s]
[INFO] CMS Reporting ..................................... SKIPPED
[INFO] CMS Gallery ....................................... SKIPPED
[INFO] CMS Gallery Common ................................ SKIPPED
[INFO] CMS Gallery Plugins ............................... SKIPPED
[INFO] CMS Xinha Editor Plugin ........................... SKIPPED
[INFO] CMS Xinha Resources ............................... SKIPPED
[INFO] CMS Xinha Editor Plugin Test ...................... SKIPPED
[INFO] CMS Translation Repository ........................ SKIPPED
[INFO] CMS Editor Repository ............................. SKIPPED
[INFO] CMS Editor Test ................................... SKIPPED
[INFO] CMS Translate ..................................... SKIPPED
[INFO] CMS Translation Plugins ........................... SKIPPED
[INFO] CMS Translation Test .............................. SKIPPED
[INFO] CMS Gallery Repository ............................ SKIPPED
[INFO] CMS Package Configuration ......................... SKIPPED
[INFO] CMS Skin .......................................... SKIPPED
[INFO] CMS Surf .......................................... SKIPPED
[INFO] CMS Surf Frontend ................................. SKIPPED
[INFO] CMS Surf Repository ............................... SKIPPED
[INFO] CMS Upgrade Modules ............................... SKIPPED
[INFO] CMS Resources ..................................... SKIPPED
[INFO] CMS jQuery ........................................ SKIPPED
[INFO] CMS Dependencies .................................. SKIPPED
[INFO] CMS Repository Dependencies ....................... SKIPPED
[INFO] CMS Tools ......................................... SKIPPED
[INFO] CMS Eclipse utilities ............................. SKIPPED
[INFO] CMS Development content ........................... SKIPPED
[INFO] CMS Upgrade utilities ............................. SKIPPED
[INFO] Translation runner ................................ SKIPPED
[INFO] ------------------------------------------------------------------------
[INFO] BUILD FAILURE
[INFO] ------------------------------------------------------------------------
[INFO] Total time: 3:54.104s
[INFO] Finished at: Fri Sep 13 15:10:41 CEST 2013
[INFO] Final Memory: 43M/104M
[INFO] ------------------------------------------------------------------------
maven builder waiting
mavenExecutionResult exceptions not empty
org.apache.maven.lifecycle.LifecycleExecutionException: Failed to execute goal org.apache.maven.plugins:maven-compiler-plugin:2.3.2:compile (default-compile) on project hippo-cms-perspectives: Compilation failure
<https://builds.onehippo.org/job/hippo-cms-2.22.xx/ws/perspectives/src/main/java/org/hippoecm/frontend/plugins/cms/admin/users/User.java>:[70,58] cannot find symbol
symbol  : variable HIPPO_SYSTEM
location: interface org.hippoecm.repository.api.HippoNodeType

	at org.apache.maven.lifecycle.internal.MojoExecutor.execute(MojoExecutor.java:213)
	at org.apache.maven.lifecycle.internal.MojoExecutor.execute(MojoExecutor.java:153)
	at org.apache.maven.lifecycle.internal.MojoExecutor.execute(MojoExecutor.java:145)
	at org.apache.maven.lifecycle.internal.LifecycleModuleBuilder.buildProject(LifecycleModuleBuilder.java:84)
	at org.apache.maven.lifecycle.internal.LifecycleModuleBuilder.buildProject(LifecycleModuleBuilder.java:59)
	at org.apache.maven.lifecycle.internal.LifecycleStarter.singleThreadedBuild(LifecycleStarter.java:183)
	at org.apache.maven.lifecycle.internal.LifecycleStarter.execute(LifecycleStarter.java:161)
	at org.apache.maven.DefaultMaven.doExecute(DefaultMaven.java:320)
	at org.apache.maven.DefaultMaven.execute(DefaultMaven.java:156)
	at org.jvnet.hudson.maven3.launcher.Maven3Launcher.main(Maven3Launcher.java:79)
	at sun.reflect.NativeMethodAccessorImpl.invoke0(Native Method)
	at sun.reflect.NativeMethodAccessorImpl.invoke(NativeMethodAccessorImpl.java:39)
	at sun.reflect.DelegatingMethodAccessorImpl.invoke(DelegatingMethodAccessorImpl.java:25)
	at java.lang.reflect.Method.invoke(Method.java:597)
	at org.codehaus.plexus.classworlds.launcher.Launcher.launchStandard(Launcher.java:329)
	at org.codehaus.plexus.classworlds.launcher.Launcher.launch(Launcher.java:239)
	at org.jvnet.hudson.maven3.agent.Maven3Main.launch(Maven3Main.java:146)
	at hudson.maven.Maven3Builder.call(Maven3Builder.java:124)
	at hudson.maven.Maven3Builder.call(Maven3Builder.java:71)
	at hudson.remoting.UserRequest.perform(UserRequest.java:107)
	at hudson.remoting.UserRequest.perform(UserRequest.java:41)
	at hudson.remoting.Request$2.run(Request.java:276)
	at java.util.concurrent.Executors$RunnableAdapter.call(Executors.java:441)
	at java.util.concurrent.FutureTask$Sync.innerRun(FutureTask.java:303)
	at java.util.concurrent.FutureTask.run(FutureTask.java:138)
	at java.util.concurrent.ThreadPoolExecutor$Worker.runTask(ThreadPoolExecutor.java:886)
	at java.util.concurrent.ThreadPoolExecutor$Worker.run(ThreadPoolExecutor.java:908)
	at java.lang.Thread.run(Thread.java:662)
Caused by: org.apache.maven.plugin.CompilationFailureException: Compilation failure
<https://builds.onehippo.org/job/hippo-cms-2.22.xx/ws/perspectives/src/main/java/org/hippoecm/frontend/plugins/cms/admin/users/User.java>:[70,58] cannot find symbol
symbol  : variable HIPPO_SYSTEM
location: interface org.hippoecm.repository.api.HippoNodeType

	at org.apache.maven.plugin.AbstractCompilerMojo.execute(AbstractCompilerMojo.java:656)
	at org.apache.maven.plugin.CompilerMojo.execute(CompilerMojo.java:128)
	at org.apache.maven.plugin.DefaultBuildPluginManager.executeMojo(DefaultBuildPluginManager.java:101)
	at org.apache.maven.lifecycle.internal.MojoExecutor.execute(MojoExecutor.java:209)
	... 27 more
Sending e-mails to: hippo-cms7-dev at lists.onehippo.org
channel stopped

--
This message is automatically generated by Hudson. 
For more information on Hudson, see: http://hudson-ci.org/


More information about the Hippo-cms7-dev mailing list