[Hippo-cms7-dev] [Hudson] Build failed in Hudson: Repository Integration Trunk #672

Hippo Integration Hudson Server beheer at onehippo.com
Sun Sep 15 10:03:39 CEST 2013


See <https://integration.onehippo.com/job/Repository%20Integration%20Trunk/672/>

------------------------------------------
[...truncated 1192 lines...]
Running org.hippoecm.repository.HREPTWO650Test
Tests run: 1, Failures: 0, Errors: 0, Skipped: 0, Time elapsed: 1.128 sec
Running org.hippoecm.repository.MemoryTest
Tests run: 2, Failures: 0, Errors: 0, Skipped: 0, Time elapsed: 3.456 sec
Running org.hippoecm.repository.HREPTWO280Test
Tests run: 1, Failures: 0, Errors: 0, Skipped: 0, Time elapsed: 1.352 sec
Running org.hippoecm.repository.VersioningWorkflowTest
Tests run: 2, Failures: 0, Errors: 0, Skipped: 0, Time elapsed: 0.332 sec
Running org.hippoecm.repository.CanonicalPathTest
Tests run: 3, Failures: 0, Errors: 0, Skipped: 0, Time elapsed: 0.088 sec
Running org.hippoecm.repository.SecurityDelegationTest
Tests run: 3, Failures: 0, Errors: 0, Skipped: 0, Time elapsed: 0.192 sec
Running org.hippoecm.repository.ConcurrentLinkModificationTest
Tests run: 1, Failures: 0, Errors: 0, Skipped: 0, Time elapsed: 0.064 sec
Running org.hippoecm.repository.HREPTWO1493Test
Tests run: 3, Failures: 0, Errors: 0, Skipped: 0, Time elapsed: 0.192 sec
Running org.hippoecm.repository.FacetedNavigationHippoCountTest
Tests run: 1, Failures: 0, Errors: 0, Skipped: 0, Time elapsed: 0.032 sec
Running org.hippoecm.repository.HREPTWO2655IssueTest
Tests run: 1, Failures: 0, Errors: 0, Skipped: 0, Time elapsed: 0.028 sec
Running org.hippoecm.repository.HREPTWO475Test
Tests run: 1, Failures: 0, Errors: 0, Skipped: 0, Time elapsed: 0.092 sec
Running org.hippoecm.repository.FacetedAuthorizationTest
Tests run: 36, Failures: 0, Errors: 0, Skipped: 0, Time elapsed: 9.648 sec
Running org.hippoecm.repository.HREPTWO456Test
Tests run: 1, Failures: 0, Errors: 0, Skipped: 0, Time elapsed: 0.024 sec
Running org.hippoecm.repository.HREPTWO283IssueTest
Tests run: 2, Failures: 0, Errors: 0, Skipped: 0, Time elapsed: 0.072 sec
Running org.hippoecm.repository.HREPTWO451Test
Tests run: 1, Failures: 0, Errors: 0, Skipped: 0, Time elapsed: 0.044 sec
Running org.hippoecm.repository.CopyNodeTest
Tests run: 2, Failures: 0, Errors: 0, Skipped: 0, Time elapsed: 0.064 sec
Running org.hippoecm.repository.HREPTWO425Test
Tests run: 1, Failures: 0, Errors: 0, Skipped: 0, Time elapsed: 0.032 sec
Running org.hippoecm.repository.ConfigurationTest
Tests run: 26, Failures: 0, Errors: 0, Skipped: 0, Time elapsed: 1.26 sec
Running org.hippoecm.repository.ReferringDocumentsTest
Tests run: 1, Failures: 0, Errors: 0, Skipped: 0, Time elapsed: 6.852 sec
Running org.hippoecm.repository.FacetedNavigationTest
Tests run: 7, Failures: 0, Errors: 0, Skipped: 0, Time elapsed: 21.572 sec
Running org.hippoecm.repository.CheckoutNodeTest
Tests run: 1, Failures: 0, Errors: 0, Skipped: 0, Time elapsed: 0.052 sec
Running org.hippoecm.repository.HREPTWO548Test
Tests run: 1, Failures: 0, Errors: 0, Skipped: 0, Time elapsed: 0.056 sec
Running org.hippoecm.repository.HREPTWO690Test
Tests run: 1, Failures: 0, Errors: 0, Skipped: 0, Time elapsed: 0.032 sec
Running org.hippoecm.repository.FacetedNavigationChildNameTest
Tests run: 1, Failures: 0, Errors: 0, Skipped: 0, Time elapsed: 2.332 sec
Running org.hippoecm.repository.FacetedNavigationNamespaceTest
Tests run: 6, Failures: 0, Errors: 0, Skipped: 0, Time elapsed: 1.412 sec
Running org.hippoecm.repository.translation.TranslationVirtualProviderTest
Tests run: 5, Failures: 0, Errors: 0, Skipped: 0, Time elapsed: 0.396 sec
Running org.hippoecm.repository.quartz.SchedulerTest
15.09.2013 09:59:23 ERROR [org.hippoecm.repository.quartz.JCRJobStore.triggerFired():379] Failed to verify job
org.quartz.JobPersistenceException: No such job: b0d56741-180e-4893-a86e-2fb5470ebd48
	at org.hippoecm.repository.quartz.JCRJobStore.retrieveJob(JCRJobStore.java:173)
	at org.hippoecm.repository.quartz.JCRJobStore.triggerFired(JCRJobStore.java:374)
	at org.quartz.core.QuartzSchedulerThread.run(QuartzSchedulerThread.java:320)
Tests run: 4, Failures: 0, Errors: 0, Skipped: 0, Time elapsed: 5.56 sec
Running org.hippoecm.repository.HREPTWO3870IssueTest
15.09.2013 09:59:26 WARN  [org.hippoecm.repository.HREPTWO3870IssueTest.removeAndAddFacetsearch():105] Issue HREPTWO-3870 is not yet solved, error: javax.jcr.RepositoryException: Unable to update item: item.save()
Tests run: 1, Failures: 0, Errors: 0, Skipped: 0, Time elapsed: 0.14 sec
Running org.hippoecm.repository.HREPTWO4837Test
Tests run: 1, Failures: 0, Errors: 0, Skipped: 0, Time elapsed: 0.028 sec
Running org.hippoecm.repository.WorkflowEventTest
Tests run: 1, Failures: 0, Errors: 0, Skipped: 0, Time elapsed: 0.3 sec
Running org.hippoecm.repository.PhysicalExportSystemViewTest
Tests run: 3, Failures: 0, Errors: 0, Skipped: 0, Time elapsed: 5.54 sec
Running org.onehippo.repository.search.ServicingNodeIndexerSimilarityTest
Tests run: 1, Failures: 0, Errors: 0, Skipped: 0, Time elapsed: 0.044 sec
Running org.onehippo.repository.search.ServicingNodeIndexerTest
Tests run: 5, Failures: 0, Errors: 0, Skipped: 0, Time elapsed: 0.116 sec
Running org.onehippo.repository.LocalRefreshTest
Tests run: 2, Failures: 0, Errors: 0, Skipped: 0, Time elapsed: 0.048 sec

Results :

Tests run: 199, Failures: 0, Errors: 0, Skipped: 0

[INFO] 
[INFO] --- maven-jar-plugin:2.4:jar (default-jar) @ hippo-repository-test ---
[INFO] Building jar: <https://integration.onehippo.com/job/Repository%20Integration%20Trunk/ws/test/target/hippo-repository-test-2.25.04-SNAPSHOT.jar>
[INFO] 
[INFO] --- maven-source-plugin:2.2.1:jar-no-fork (attach-sources) @ hippo-repository-test ---
[INFO] Building jar: <https://integration.onehippo.com/job/Repository%20Integration%20Trunk/ws/test/target/hippo-repository-test-2.25.04-SNAPSHOT-sources.jar>
[INFO] 
[INFO] --- maven-failsafe-plugin:2.16:integration-test (default) @ hippo-repository-test ---
[INFO] Failsafe report directory: <https://integration.onehippo.com/job/Repository%20Integration%20Trunk/ws/test/target/failsafe-reports>

-------------------------------------------------------
 T E S T S
-------------------------------------------------------
Running org.hippoecm.repository.concurrent.StampedeTest
15.09.2013 09:59:50 ERROR [org.hippoecm.repository.standardworkflow.FolderWorkflowImpl.doArchive():375] error while deleting document variants from attic
javax.jcr.RepositoryException: org.apache.jackrabbit.core.state.StaleItemStateException: 8ec6bd8a-b78a-4f83-82f5-6c74979dabb9/{http://www.jcp.org/jcr/1.0}predecessors has been modified externally
	at org.apache.jackrabbit.core.version.VersionManagerImplBase.checkoutCheckin(VersionManagerImplBase.java:218)
	at org.apache.jackrabbit.core.VersionManagerImpl.access$100(VersionManagerImpl.java:73)
	at org.apache.jackrabbit.core.VersionManagerImpl$1.perform(VersionManagerImpl.java:122)
	at org.apache.jackrabbit.core.VersionManagerImpl$1.perform(VersionManagerImpl.java:115)
	at org.apache.jackrabbit.core.session.SessionState.perform(SessionState.java:216)
	at org.apache.jackrabbit.core.VersionManagerImpl.perform(VersionManagerImpl.java:96)
	at org.apache.jackrabbit.core.VersionManagerImpl.checkin(VersionManagerImpl.java:115)
	at org.apache.jackrabbit.core.VersionManagerImpl.checkin(VersionManagerImpl.java:101)
	at org.apache.jackrabbit.core.NodeImpl.checkin(NodeImpl.java:2879)
	at org.hippoecm.repository.decorating.NodeDecorator.checkin(NodeDecorator.java:379)
	at org.hippoecm.repository.impl.NodeDecorator.checkin(NodeDecorator.java:172)
	at org.hippoecm.repository.standardworkflow.FolderWorkflowImpl.doArchive(FolderWorkflowImpl.java:372)
	at org.hippoecm.repository.standardworkflow.FolderWorkflowImpl.archive(FolderWorkflowImpl.java:431)
	at sun.reflect.NativeMethodAccessorImpl.invoke0(Native Method)
	at sun.reflect.NativeMethodAccessorImpl.invoke(NativeMethodAccessorImpl.java:57)
	at sun.reflect.DelegatingMethodAccessorImpl.invoke(DelegatingMethodAccessorImpl.java:43)
	at java.lang.reflect.Method.invoke(Method.java:601)
	at org.hippoecm.repository.impl.WorkflowManagerImpl$WorkflowInvocationImpl.invoke(WorkflowManagerImpl.java:867)
	at org.hippoecm.repository.impl.WorkflowManagerImpl$WorkflowInvocationHandler.invoke(WorkflowManagerImpl.java:536)
	at $Proxy19.delete(Unknown Source)
	at org.hippoecm.repository.concurrent.action.DeleteDocumentAction.doExecute(DeleteDocumentAction.java:29)
	at org.hippoecm.repository.concurrent.action.Action.execute(Action.java:43)
	at org.hippoecm.repository.concurrent.AbstractRandomActionTest$RandomActionRunner.step(AbstractRandomActionTest.java:251)
	at org.hippoecm.repository.concurrent.AbstractRandomActionTest$RandomActionRunner.run(AbstractRandomActionTest.java:192)
Caused by: org.apache.jackrabbit.core.state.StaleItemStateException: 8ec6bd8a-b78a-4f83-82f5-6c74979dabb9/{http://www.jcp.org/jcr/1.0}predecessors has been modified externally
	at org.apache.jackrabbit.core.state.SharedItemStateManager$Update.begin(SharedItemStateManager.java:679)
	at org.apache.jackrabbit.core.state.SharedItemStateManager.beginUpdate(SharedItemStateManager.java:1507)
	at org.apache.jackrabbit.core.state.SharedItemStateManager.update(SharedItemStateManager.java:1537)
	at org.hippoecm.repository.jackrabbit.HippoSharedItemStateManager.update(HippoSharedItemStateManager.java:90)
	at org.apache.jackrabbit.core.state.LocalItemStateManager.update(LocalItemStateManager.java:400)
	at org.apache.jackrabbit.core.state.XAItemStateManager.update(XAItemStateManager.java:354)
	at org.hippoecm.repository.jackrabbit.HippoLocalItemStateManager.update(HippoLocalItemStateManager.java:280)
	at org.apache.jackrabbit.core.state.LocalItemStateManager.update(LocalItemStateManager.java:375)
	at org.hippoecm.repository.jackrabbit.HippoLocalItemStateManager.update(HippoLocalItemStateManager.java:289)
	at org.apache.jackrabbit.core.version.VersionManagerImplBase$WriteOperation.save(VersionManagerImplBase.java:470)
	at org.apache.jackrabbit.core.version.VersionManagerImplBase.checkoutCheckin(VersionManagerImplBase.java:215)
	... 23 more
15.09.2013 10:00:06 ERROR [org.hippoecm.repository.impl.WorkflowManagerImpl.getWorkflowNode():165] Workflow category does not exist or workflows definition missing failed to build path of 14571fe7-323e-4524-8a49-26598294648c: 5ced3179-d06e-44bc-bcb2-918759e7da67 has no child entry for 14571fe7-323e-4524-8a49-26598294648c
15.09.2013 10:00:25 WARN  [org.hippoecm.repository.impl.SessionDecorator.save():183] javax.jcr.RepositoryException: org.apache.jackrabbit.core.state.StaleItemStateException: ba08fb5e-34e3-43b8-b9d9-a153ef365422/{http://www.jcp.org/jcr/1.0}isCheckedOut has been modified externally
javax.jcr.RepositoryException: org.apache.jackrabbit.core.state.StaleItemStateException: ba08fb5e-34e3-43b8-b9d9-a153ef365422/{http://www.jcp.org/jcr/1.0}isCheckedOut has been modified externally
	at org.apache.jackrabbit.core.version.VersionManagerImplBase.checkoutCheckin(VersionManagerImplBase.java:218)
	at org.apache.jackrabbit.core.VersionManagerImpl.access$300(VersionManagerImpl.java:73)
	at org.apache.jackrabbit.core.VersionManagerImpl$2.perform(VersionManagerImpl.java:142)
	at org.apache.jackrabbit.core.VersionManagerImpl$2.perform(VersionManagerImpl.java:135)
	at org.apache.jackrabbit.core.session.SessionState.perform(SessionState.java:216)
	at org.apache.jackrabbit.core.VersionManagerImpl.perform(VersionManagerImpl.java:96)
	at org.apache.jackrabbit.core.VersionManagerImpl.checkout(VersionManagerImpl.java:135)
	at org.apache.jackrabbit.core.NodeImpl.checkout(NodeImpl.java:2898)
	at org.hippoecm.repository.decorating.NodeDecorator.checkout(NodeDecorator.java:387)
	at org.hippoecm.repository.impl.NodeDecorator.checkout(NodeDecorator.java:186)
	at org.hippoecm.repository.deriveddata.DerivedDataEngine.ensureNodeIsCheckedOut(DerivedDataEngine.java:217)
	at org.hippoecm.repository.deriveddata.DerivedDataEngine.compute(DerivedDataEngine.java:184)
	at org.hippoecm.repository.deriveddata.DerivedDataEngine.save(DerivedDataEngine.java:85)
	at org.hippoecm.repository.deriveddata.DerivedDataEngine.save(DerivedDataEngine.java:65)
	at org.hippoecm.repository.impl.SessionDecorator.save(SessionDecorator.java:172)
	at org.hippoecm.repository.standardworkflow.FolderWorkflowImpl.doArchive(FolderWorkflowImpl.java:354)
	at org.hippoecm.repository.standardworkflow.FolderWorkflowImpl.archive(FolderWorkflowImpl.java:431)
	at sun.reflect.GeneratedMethodAccessor12.invoke(Unknown Source)
	at sun.reflect.DelegatingMethodAccessorImpl.invoke(DelegatingMethodAccessorImpl.java:43)
	at java.lang.reflect.Method.invoke(Method.java:601)
	at org.hippoecm.repository.impl.WorkflowManagerImpl$WorkflowInvocationImpl.invoke(WorkflowManagerImpl.java:867)
	at org.hippoecm.repository.impl.WorkflowManagerImpl$WorkflowInvocationHandler.invoke(WorkflowManagerImpl.java:536)
	at $Proxy19.delete(Unknown Source)
	at org.hippoecm.repository.concurrent.action.DeleteDocumentAction.doExecute(DeleteDocumentAction.java:29)
	at org.hippoecm.repository.concurrent.action.Action.execute(Action.java:43)
	at org.hippoecm.repository.concurrent.AbstractRandomActionTest$RandomActionRunner.step(AbstractRandomActionTest.java:251)
	at org.hippoecm.repository.concurrent.AbstractRandomActionTest$RandomActionRunner.run(AbstractRandomActionTest.java:192)
Caused by: org.apache.jackrabbit.core.state.StaleItemStateException: ba08fb5e-34e3-43b8-b9d9-a153ef365422/{http://www.jcp.org/jcr/1.0}isCheckedOut has been modified externally
	at org.apache.jackrabbit.core.state.SharedItemStateManager$Update.begin(SharedItemStateManager.java:679)
	at org.apache.jackrabbit.core.state.SharedItemStateManager.beginUpdate(SharedItemStateManager.java:1507)
	at org.apache.jackrabbit.core.state.SharedItemStateManager.update(SharedItemStateManager.java:1537)
	at org.hippoecm.repository.jackrabbit.HippoSharedItemStateManager.update(HippoSharedItemStateManager.java:90)
	at org.apache.jackrabbit.core.state.LocalItemStateManager.update(LocalItemStateManager.java:400)
	at org.apache.jackrabbit.core.state.XAItemStateManager.update(XAItemStateManager.java:354)
	at org.hippoecm.repository.jackrabbit.HippoLocalItemStateManager.update(HippoLocalItemStateManager.java:280)
	at org.apache.jackrabbit.core.state.LocalItemStateManager.update(LocalItemStateManager.java:375)
	at org.hippoecm.repository.jackrabbit.HippoLocalItemStateManager.update(HippoLocalItemStateManager.java:289)
	at org.apache.jackrabbit.core.version.VersionManagerImplBase$WriteOperation.save(VersionManagerImplBase.java:470)
	at org.apache.jackrabbit.core.version.VersionManagerImplBase.checkoutCheckin(VersionManagerImplBase.java:215)
	... 26 more
15.09.2013 10:00:48 INFO  [org.hippoecm.repository.concurrent.AbstractRandomActionTest$RandomActionRunner.keepRunning():271] Stopping RandomActionRunner[Thread-12] because of end of test run
15.09.2013 10:00:48 INFO  [org.hippoecm.repository.concurrent.AbstractRandomActionTest$RandomActionRunner.keepRunning():271] Stopping RandomActionRunner[Thread-14] because of end of test run
15.09.2013 10:00:48 INFO  [org.hippoecm.repository.concurrent.AbstractRandomActionTest$RandomActionRunner.keepRunning():271] Stopping RandomActionRunner[Thread-13] because of end of test run
GetDocumentBaseNodeAction executed 319 times; failed 0 times; total time spent 4 ms; average time 0
GetAssetBaseNodeAction executed 154 times; failed 0 times; total time spent 4 ms; average time 0
GetRandomChildNodeAction executed 616 times; failed 0 times; total time spent 156 ms; average time 0
AddDocumentFolderAction executed 51 times; failed 0 times; total time spent 2092 ms; average time 41
AddAssetFolderAction executed 72 times; failed 0 times; total time spent 2876 ms; average time 39
AddNewsDocumentAction executed 188 times; failed 0 times; total time spent 13060 ms; average time 69
PublishAction executed 77 times; failed 0 times; total time spent 12792 ms; average time 166
DepublishAction executed 49 times; failed 0 times; total time spent 8432 ms; average time 172
DeleteDocumentAction executed 95 times; failed 0 times; total time spent 19448 ms; average time 204
LoadDocumentAction executed 294 times; failed 0 times; total time spent 140 ms; average time 0
AddDocumentLinkAction executed 106 times; failed 0 times; total time spent 10908 ms; average time 102
EditDocumentAction executed 110 times; failed 0 times; total time spent 24908 ms; average time 226
AddAssetAction executed 61 times; failed 0 times; total time spent 10644 ms; average time 174
DeleteAssetAction executed 41 times; failed 0 times; total time spent 2248 ms; average time 54
RenameAssetAction executed 46 times; failed 0 times; total time spent 2952 ms; average time 64
DeleteFolderAction executed 54 times; failed 0 times; total time spent 1860 ms; average time 34
RenameDocumentAction executed 95 times; failed 0 times; total time spent 6892 ms; average time 72
MoveDocumentAction executed 71 times; failed 0 times; total time spent 7188 ms; average time 101
Total actions run: 2499
Total successful actions: 2487
Total write actions run: 1116
Total missed actions: 12
Total failed actions: 0
Successrate: 1.0
Total time it took: 60.044 sec
Tests run: 1, Failures: 0, Errors: 0, Skipped: 0, Time elapsed: 79.004 sec - in org.hippoecm.repository.concurrent.StampedeTest
Running org.hippoecm.repository.updater.UpdaterTest
Tests run: 3, Failures: 0, Errors: 0, Skipped: 0, Time elapsed: 12.124 sec - in org.hippoecm.repository.updater.UpdaterTest
Running org.hippoecm.repository.sample.SampleRemoteWorkflowTest
Tests run: 2, Failures: 0, Errors: 0, Skipped: 0, Time elapsed: 12.412 sec - in org.hippoecm.repository.sample.SampleRemoteWorkflowTest
Running org.hippoecm.repository.facetnavigation.FacetedNavigationConcurrencyTest
Tests run: 4, Failures: 0, Errors: 0, Skipped: 0, Time elapsed: 72.948 sec - in org.hippoecm.repository.facetnavigation.FacetedNavigationConcurrencyTest
Running org.hippoecm.repository.TotalSizeTest
Tests run: 4, Failures: 0, Errors: 0, Skipped: 0, Time elapsed: 21.88 sec - in org.hippoecm.repository.TotalSizeTest
Running org.hippoecm.repository.test.RemoteTest
Tests run: 1, Failures: 0, Errors: 0, Skipped: 1, Time elapsed: 0 sec - in org.hippoecm.repository.test.RemoteTest
Running org.hippoecm.repository.test.WorkflowChainingTest
Tests run: 2, Failures: 0, Errors: 0, Skipped: 0, Time elapsed: 36.48 sec - in org.hippoecm.repository.test.WorkflowChainingTest
Running org.hippoecm.repository.decorating.MirrorTest
[ERROR] Failure: hudson.remoting.RequestAbortedException: hudson.remoting.RequestAbortedException: java.io.IOException: Unexpected termination of the channel
FATAL: hudson.remoting.RequestAbortedException: hudson.remoting.RequestAbortedException: java.io.IOException: Unexpected termination of the channel
org.hudsonci.utils.tasks.OperationFailure: hudson.remoting.RequestAbortedException: hudson.remoting.RequestAbortedException: java.io.IOException: Unexpected termination of the channel
	at org.hudsonci.utils.tasks.PerformOperation.execute(PerformOperation.java:64)
	at org.hudsonci.maven.plugin.builder.MavenBuilder.perform(MavenBuilder.java:169)
	at hudson.tasks.BuildStepMonitor$1.perform(BuildStepMonitor.java:34)
	at hudson.model.AbstractBuild$AbstractRunner.perform(AbstractBuild.java:646)
	at hudson.model.Build$RunnerImpl.build(Build.java:181)
	at hudson.model.Build$RunnerImpl.doRun(Build.java:136)
	at hudson.model.AbstractBuild$AbstractRunner.run(AbstractBuild.java:434)
	at hudson.model.Run.run(Run.java:1390)
	at hudson.model.FreeStyleBuild.run(FreeStyleBuild.java:40)
	at hudson.model.ResourceController.execute(ResourceController.java:82)
	at hudson.model.Executor.run(Executor.java:137)
Caused by: hudson.remoting.RequestAbortedException: hudson.remoting.RequestAbortedException: java.io.IOException: Unexpected termination of the channel
	at hudson.remoting.Request.call(Request.java:142)
	at hudson.remoting.Channel.call(Channel.java:643)
	at org.hudsonci.maven.plugin.builder.internal.PerformBuild.doExecute(PerformBuild.java:198)
	at org.hudsonci.utils.tasks.PerformOperation.execute(PerformOperation.java:50)
	... 10 more
Caused by: hudson.remoting.RequestAbortedException: java.io.IOException: Unexpected termination of the channel
	at hudson.remoting.Request.abort(Request.java:262)
	at hudson.remoting.Channel.terminate(Channel.java:743)
	at hudson.slaves.Channels$1.terminate(Channels.java:71)
	at hudson.remoting.Channel$ReaderThread.run(Channel.java:1042)
Caused by: java.io.IOException: Unexpected termination of the channel
	at hudson.remoting.Channel$ReaderThread.run(Channel.java:1023)
Caused by: java.io.EOFException
	at java.io.ObjectInputStream$BlockDataInputStream.peekByte(ObjectInputStream.java:2571)
	at java.io.ObjectInputStream.readObject0(ObjectInputStream.java:1315)
	at java.io.ObjectInputStream.readObject(ObjectInputStream.java:369)
	at hudson.remoting.Channel$ReaderThread.run(Channel.java:1017)

--
This message is automatically generated by Hudson. 
For more information on Hudson, see: http://hudson-ci.org/


More information about the Hippo-cms7-dev mailing list