[Hippo-cms7-dev] [Hudson] Build failed in Hudson: hippo-repository Trunk Nightly #731

Hippo Public Hudson Server beheer at onehippo.com
Mon Sep 16 04:18:18 CEST 2013


See <https://builds.onehippo.org/job/hippo-repository%20Trunk%20Nightly/731/>

------------------------------------------
[...truncated 1472 lines...]
Sep 16, 2013 4:18:10 AM org.apache.commons.httpclient.auth.AuthChallengeProcessor selectAuthScheme
INFO: basic authentication scheme selected
Sep 16, 2013 4:18:10 AM org.apache.commons.httpclient.auth.AuthChallengeProcessor selectAuthScheme
INFO: basic authentication scheme selected
Uploaded: https://maven.onehippo.com/content/repositories/snapshots/org/onehippo/cms7/hippo-repository-deprecated-facetsearch/2.25.04-SNAPSHOT/maven-metadata.xml (3 KB at 8.5 KB/sec)
projectSucceeded org.onehippo.cms7:hippo-repository-deprecated-facetsearch:2.25.04-SNAPSHOT
[HUDSON] Archiving <https://builds.onehippo.org/job/hippo-repository%20Trunk%20Nightly/ws/deprecated/facetsearch/pom.xml> to /var/hudson-data/jobs/hippo-repository Trunk Nightly/modules/org.onehippo.cms7$hippo-repository-deprecated-facetsearch/builds/2013-09-16_04-16-58/archive/org.onehippo.cms7/hippo-repository-deprecated-facetsearch/2.25.04-SNAPSHOT/pom.xml
[HUDSON] Archiving <https://builds.onehippo.org/job/hippo-repository%20Trunk%20Nightly/ws/deprecated/facetsearch/target/hippo-repository-deprecated-facetsearch-2.25.04-SNAPSHOT.jar> to /var/hudson-data/jobs/hippo-repository Trunk Nightly/modules/org.onehippo.cms7$hippo-repository-deprecated-facetsearch/builds/2013-09-16_04-16-58/archive/org.onehippo.cms7/hippo-repository-deprecated-facetsearch/2.25.04-20130916.021808-18/hippo-repository-deprecated-facetsearch-2.25.04-SNAPSHOT.jar
[HUDSON] Archiving <https://builds.onehippo.org/job/hippo-repository%20Trunk%20Nightly/ws/deprecated/facetsearch/target/hippo-repository-deprecated-facetsearch-2.25.04-SNAPSHOT-sources.jar> to /var/hudson-data/jobs/hippo-repository Trunk Nightly/modules/org.onehippo.cms7$hippo-repository-deprecated-facetsearch/builds/2013-09-16_04-16-58/archive/org.onehippo.cms7/hippo-repository-deprecated-facetsearch/2.25.04-20130916.021808-18/hippo-repository-deprecated-facetsearch-2.25.04-SNAPSHOT-sources.jar
[INFO]                                                                         
[INFO] ------------------------------------------------------------------------
[INFO] Building Repository Upgrade 2.25.04-SNAPSHOT
[INFO] ------------------------------------------------------------------------
[INFO] 
[INFO] --- maven-clean-plugin:2.4.1:clean (default-clean) @ hippo-repository-upgrade ---
[INFO] 
[INFO] --- maven-remote-resources-plugin:1.4:process (default) @ hippo-repository-upgrade ---
[INFO] 
[INFO] --- maven-source-plugin:2.2.1:jar-no-fork (attach-sources) @ hippo-repository-upgrade ---
[INFO] 
[INFO] Installing <https://builds.onehippo.org/job/hippo-repository%20Trunk%20Nightly/ws/upgrade/pom.xml> to /var/hudson-data/repository/m2/org/onehippo/cms7/hippo-repository-upgrade/2.25.04-SNAPSHOT/hippo-repository-upgrade-2.25.04-SNAPSHOT.pom
[INFO] --- maven-install-plugin:2.3.1:install (default-install) @ hippo-repository-upgrade ---
[INFO] 
Downloading: https://maven.onehippo.com/content/repositories/snapshots/org/onehippo/cms7/hippo-repository-upgrade/2.25.04-SNAPSHOT/maven-metadata.xml
[INFO] --- maven-deploy-plugin:2.7:deploy (default-deploy) @ hippo-repository-upgrade ---
Downloaded: https://maven.onehippo.com/content/repositories/snapshots/org/onehippo/cms7/hippo-repository-upgrade/2.25.04-SNAPSHOT/maven-metadata.xml (624 B at 7.6 KB/sec)
Uploading: https://maven.onehippo.com/content/repositories/snapshots/org/onehippo/cms7/hippo-repository-upgrade/2.25.04-SNAPSHOT/hippo-repository-upgrade-2.25.04-20130916.021811-23.pom
Sep 16, 2013 4:18:11 AM org.apache.commons.httpclient.auth.AuthChallengeProcessor selectAuthScheme
INFO: basic authentication scheme selected
Sep 16, 2013 4:18:11 AM org.apache.commons.httpclient.auth.AuthChallengeProcessor selectAuthScheme
INFO: basic authentication scheme selected
Sep 16, 2013 4:18:11 AM org.apache.commons.httpclient.auth.AuthChallengeProcessor selectAuthScheme
INFO: basic authentication scheme selected
Uploaded: https://maven.onehippo.com/content/repositories/snapshots/org/onehippo/cms7/hippo-repository-upgrade/2.25.04-SNAPSHOT/hippo-repository-upgrade-2.25.04-20130916.021811-23.pom (3 KB at 10.1 KB/sec)
Downloading: https://maven.onehippo.com/content/repositories/snapshots/org/onehippo/cms7/hippo-repository-upgrade/maven-metadata.xml
Downloaded: https://maven.onehippo.com/content/repositories/snapshots/org/onehippo/cms7/hippo-repository-upgrade/maven-metadata.xml (491 B at 5.4 KB/sec)
Uploading: https://maven.onehippo.com/content/repositories/snapshots/org/onehippo/cms7/hippo-repository-upgrade/2.25.04-SNAPSHOT/maven-metadata.xml
Sep 16, 2013 4:18:11 AM org.apache.commons.httpclient.auth.AuthChallengeProcessor selectAuthScheme
INFO: basic authentication scheme selected
Sep 16, 2013 4:18:11 AM org.apache.commons.httpclient.auth.AuthChallengeProcessor selectAuthScheme
INFO: basic authentication scheme selected
Sep 16, 2013 4:18:11 AM org.apache.commons.httpclient.auth.AuthChallengeProcessor selectAuthScheme
INFO: basic authentication scheme selected
Uploaded: https://maven.onehippo.com/content/repositories/snapshots/org/onehippo/cms7/hippo-repository-upgrade/2.25.04-SNAPSHOT/maven-metadata.xml (2 KB at 5.3 KB/sec)
Uploading: https://maven.onehippo.com/content/repositories/snapshots/org/onehippo/cms7/hippo-repository-upgrade/maven-metadata.xml
Sep 16, 2013 4:18:11 AM org.apache.commons.httpclient.auth.AuthChallengeProcessor selectAuthScheme
INFO: basic authentication scheme selected
Sep 16, 2013 4:18:11 AM org.apache.commons.httpclient.auth.AuthChallengeProcessor selectAuthScheme
INFO: basic authentication scheme selected
Sep 16, 2013 4:18:11 AM org.apache.commons.httpclient.auth.AuthChallengeProcessor selectAuthScheme
INFO: basic authentication scheme selected
Uploaded: https://maven.onehippo.com/content/repositories/snapshots/org/onehippo/cms7/hippo-repository-upgrade/maven-metadata.xml (982 B at 3.7 KB/sec)
projectSucceeded org.onehippo.cms7:hippo-repository-upgrade:2.25.04-SNAPSHOT
[HUDSON] Archiving <https://builds.onehippo.org/job/hippo-repository%20Trunk%20Nightly/ws/upgrade/pom.xml> to /var/hudson-data/jobs/hippo-repository Trunk Nightly/modules/org.onehippo.cms7$hippo-repository-upgrade/builds/2013-09-16_04-16-58/archive/org.onehippo.cms7/hippo-repository-upgrade/2.25.04-SNAPSHOT/pom.xml
[INFO]                                                                         
[INFO] ------------------------------------------------------------------------
[INFO] Building Repository Handle Migration 2.25.04-SNAPSHOT
[INFO] ------------------------------------------------------------------------
[INFO] 
[INFO] --- maven-clean-plugin:2.4.1:clean (default-clean) @ hippo-repository-handle-migration ---
[INFO] 
[INFO] --- maven-remote-resources-plugin:1.4:process (default) @ hippo-repository-handle-migration ---
[INFO] [INFO] Using 'UTF-8' encoding to copy filtered resources.
[INFO] Copying 1 resource
[INFO] Copying 3 resources

[INFO] --- maven-resources-plugin:2.6:resources (default-resources) @ hippo-repository-handle-migration ---
[INFO] [INFO] Compiling 2 source files to <https://builds.onehippo.org/job/hippo-repository%20Trunk%20Nightly/ws/upgrade/handlemigration/target/classes>

[INFO] --- maven-compiler-plugin:2.5.1:compile (default-compile) @ hippo-repository-handle-migration ---
[INFO] 
[INFO] --- maven-resources-plugin:2.6:testResources (default-testResources) @ hippo-repository-handle-migration ---
[INFO] Using 'UTF-8' encoding to copy filtered resources.
[INFO] skip non existing resourceDirectory <https://builds.onehippo.org/job/hippo-repository%20Trunk%20Nightly/ws/upgrade/handlemigration/src/test/resources>
[INFO] Copying 3 resources
[INFO] 
[INFO] --- maven-compiler-plugin:2.5.1:testCompile (default-testCompile) @ hippo-repository-handle-migration ---
[INFO] Compiling 1 source file to <https://builds.onehippo.org/job/hippo-repository%20Trunk%20Nightly/ws/upgrade/handlemigration/target/test-classes>
[INFO] 
[INFO] --- maven-surefire-plugin:2.12.4:test (default-test) @ hippo-repository-handle-migration ---
[INFO] Tests are skipped.
[HUDSON] Recording test results
[INFO] 
[INFO] --- maven-jar-plugin:2.4:jar (default-jar) @ hippo-repository-handle-migration ---
[INFO] Building jar: <https://builds.onehippo.org/job/hippo-repository%20Trunk%20Nightly/ws/upgrade/handlemigration/target/hippo-repository-handle-migration-2.25.04-SNAPSHOT.jar>
[INFO] 
[INFO] --- maven-source-plugin:2.2.1:jar-no-fork (attach-sources) @ hippo-repository-handle-migration ---
[INFO] Building jar: <https://builds.onehippo.org/job/hippo-repository%20Trunk%20Nightly/ws/upgrade/handlemigration/target/hippo-repository-handle-migration-2.25.04-SNAPSHOT-sources.jar>
[INFO] [INFO] Installing <https://builds.onehippo.org/job/hippo-repository%20Trunk%20Nightly/ws/upgrade/handlemigration/target/hippo-repository-handle-migration-2.25.04-SNAPSHOT.jar> to /var/hudson-data/repository/m2/org/onehippo/cms7/hippo-repository-handle-migration/2.25.04-SNAPSHOT/hippo-repository-handle-migration-2.25.04-SNAPSHOT.jar
[INFO] Installing <https://builds.onehippo.org/job/hippo-repository%20Trunk%20Nightly/ws/upgrade/handlemigration/pom.xml> to /var/hudson-data/repository/m2/org/onehippo/cms7/hippo-repository-handle-migration/2.25.04-SNAPSHOT/hippo-repository-handle-migration-2.25.04-SNAPSHOT.pom
[INFO] Installing <https://builds.onehippo.org/job/hippo-repository%20Trunk%20Nightly/ws/upgrade/handlemigration/target/hippo-repository-handle-migration-2.25.04-SNAPSHOT-sources.jar> to /var/hudson-data/repository/m2/org/onehippo/cms7/hippo-repository-handle-migration/2.25.04-SNAPSHOT/hippo-repository-handle-migration-2.25.04-SNAPSHOT-sources.jar

[INFO] --- maven-install-plugin:2.3.1:install (default-install) @ hippo-repository-handle-migration ---
[INFO] Downloading: https://maven.onehippo.com/content/repositories/snapshots/org/onehippo/cms7/hippo-repository-handle-migration/2.25.04-SNAPSHOT/maven-metadata.xml

[INFO] --- maven-deploy-plugin:2.7:deploy (default-deploy) @ hippo-repository-handle-migration ---
Downloaded: https://maven.onehippo.com/content/repositories/snapshots/org/onehippo/cms7/hippo-repository-handle-migration/2.25.04-SNAPSHOT/maven-metadata.xml (1022 B at 14.7 KB/sec)
Uploading: https://maven.onehippo.com/content/repositories/snapshots/org/onehippo/cms7/hippo-repository-handle-migration/2.25.04-SNAPSHOT/hippo-repository-handle-migration-2.25.04-20130916.021814-4.jar
Sep 16, 2013 4:18:14 AM org.apache.commons.httpclient.auth.AuthChallengeProcessor selectAuthScheme
INFO: basic authentication scheme selected
Sep 16, 2013 4:18:15 AM org.apache.commons.httpclient.auth.AuthChallengeProcessor selectAuthScheme
INFO: basic authentication scheme selected
Sep 16, 2013 4:18:15 AM org.apache.commons.httpclient.auth.AuthChallengeProcessor selectAuthScheme
INFO: basic authentication scheme selected
Uploaded: https://maven.onehippo.com/content/repositories/snapshots/org/onehippo/cms7/hippo-repository-handle-migration/2.25.04-SNAPSHOT/hippo-repository-handle-migration-2.25.04-20130916.021814-4.jar (48 KB at 203.3 KB/sec)
Uploading: https://maven.onehippo.com/content/repositories/snapshots/org/onehippo/cms7/hippo-repository-handle-migration/2.25.04-SNAPSHOT/hippo-repository-handle-migration-2.25.04-20130916.021814-4.pom
Sep 16, 2013 4:18:15 AM org.apache.commons.httpclient.auth.AuthChallengeProcessor selectAuthScheme
INFO: basic authentication scheme selected
Sep 16, 2013 4:18:15 AM org.apache.commons.httpclient.auth.AuthChallengeProcessor selectAuthScheme
INFO: basic authentication scheme selected
Sep 16, 2013 4:18:15 AM org.apache.commons.httpclient.auth.AuthChallengeProcessor selectAuthScheme
INFO: basic authentication scheme selected
Uploaded: https://maven.onehippo.com/content/repositories/snapshots/org/onehippo/cms7/hippo-repository-handle-migration/2.25.04-SNAPSHOT/hippo-repository-handle-migration-2.25.04-20130916.021814-4.pom (6 KB at 27.2 KB/sec)
Downloading: https://maven.onehippo.com/content/repositories/snapshots/org/onehippo/cms7/hippo-repository-handle-migration/maven-metadata.xml
Downloaded: https://maven.onehippo.com/content/repositories/snapshots/org/onehippo/cms7/hippo-repository-handle-migration/maven-metadata.xml (374 B at 4.0 KB/sec)
Uploading: https://maven.onehippo.com/content/repositories/snapshots/org/onehippo/cms7/hippo-repository-handle-migration/2.25.04-SNAPSHOT/maven-metadata.xml
Sep 16, 2013 4:18:15 AM org.apache.commons.httpclient.auth.AuthChallengeProcessor selectAuthScheme
INFO: basic authentication scheme selected
Sep 16, 2013 4:18:15 AM org.apache.commons.httpclient.auth.AuthChallengeProcessor selectAuthScheme
INFO: basic authentication scheme selected
Sep 16, 2013 4:18:15 AM org.apache.commons.httpclient.auth.AuthChallengeProcessor selectAuthScheme
INFO: basic authentication scheme selected
Uploaded: https://maven.onehippo.com/content/repositories/snapshots/org/onehippo/cms7/hippo-repository-handle-migration/2.25.04-SNAPSHOT/maven-metadata.xml (2 KB at 8.2 KB/sec)
Uploading: https://maven.onehippo.com/content/repositories/snapshots/org/onehippo/cms7/hippo-repository-handle-migration/maven-metadata.xml
Sep 16, 2013 4:18:15 AM org.apache.commons.httpclient.auth.AuthChallengeProcessor selectAuthScheme
INFO: basic authentication scheme selected
Sep 16, 2013 4:18:15 AM org.apache.commons.httpclient.auth.AuthChallengeProcessor selectAuthScheme
INFO: basic authentication scheme selected
Sep 16, 2013 4:18:15 AM org.apache.commons.httpclient.auth.AuthChallengeProcessor selectAuthScheme
INFO: basic authentication scheme selected
Uploaded: https://maven.onehippo.com/content/repositories/snapshots/org/onehippo/cms7/hippo-repository-handle-migration/maven-metadata.xml (748 B at 2.9 KB/sec)
Uploading: https://maven.onehippo.com/content/repositories/snapshots/org/onehippo/cms7/hippo-repository-handle-migration/2.25.04-SNAPSHOT/hippo-repository-handle-migration-2.25.04-20130916.021814-4-sources.jar
Sep 16, 2013 4:18:16 AM org.apache.commons.httpclient.auth.AuthChallengeProcessor selectAuthScheme
INFO: basic authentication scheme selected
Sep 16, 2013 4:18:16 AM org.apache.commons.httpclient.auth.AuthChallengeProcessor selectAuthScheme
INFO: basic authentication scheme selected
Sep 16, 2013 4:18:16 AM org.apache.commons.httpclient.auth.AuthChallengeProcessor selectAuthScheme
INFO: basic authentication scheme selected
Uploaded: https://maven.onehippo.com/content/repositories/snapshots/org/onehippo/cms7/hippo-repository-handle-migration/2.25.04-SNAPSHOT/hippo-repository-handle-migration-2.25.04-20130916.021814-4-sources.jar (29 KB at 136.9 KB/sec)
Uploading: https://maven.onehippo.com/content/repositories/snapshots/org/onehippo/cms7/hippo-repository-handle-migration/2.25.04-SNAPSHOT/maven-metadata.xml
Sep 16, 2013 4:18:16 AM org.apache.commons.httpclient.auth.AuthChallengeProcessor selectAuthScheme
INFO: basic authentication scheme selected
Sep 16, 2013 4:18:16 AM org.apache.commons.httpclient.auth.AuthChallengeProcessor selectAuthScheme
INFO: basic authentication scheme selected
Sep 16, 2013 4:18:16 AM org.apache.commons.httpclient.auth.AuthChallengeProcessor selectAuthScheme
INFO: basic authentication scheme selected
Uploaded: https://maven.onehippo.com/content/repositories/snapshots/org/onehippo/cms7/hippo-repository-handle-migration/2.25.04-SNAPSHOT/maven-metadata.xml (2 KB at 8.0 KB/sec)
projectSucceeded org.onehippo.cms7:hippo-repository-handle-migration:2.25.04-SNAPSHOT
[HUDSON] Archiving <https://builds.onehippo.org/job/hippo-repository%20Trunk%20Nightly/ws/upgrade/handlemigration/pom.xml> to /var/hudson-data/jobs/hippo-repository Trunk Nightly/modules/org.onehippo.cms7$hippo-repository-handle-migration/builds/2013-09-16_04-16-58/archive/org.onehippo.cms7/hippo-repository-handle-migration/2.25.04-SNAPSHOT/pom.xml
[HUDSON] Archiving <https://builds.onehippo.org/job/hippo-repository%20Trunk%20Nightly/ws/upgrade/handlemigration/target/hippo-repository-handle-migration-2.25.04-SNAPSHOT.jar> to /var/hudson-data/jobs/hippo-repository Trunk Nightly/modules/org.onehippo.cms7$hippo-repository-handle-migration/builds/2013-09-16_04-16-58/archive/org.onehippo.cms7/hippo-repository-handle-migration/2.25.04-20130916.021814-4/hippo-repository-handle-migration-2.25.04-SNAPSHOT.jar
[HUDSON] Archiving <https://builds.onehippo.org/job/hippo-repository%20Trunk%20Nightly/ws/upgrade/handlemigration/target/hippo-repository-handle-migration-2.25.04-SNAPSHOT-sources.jar> to /var/hudson-data/jobs/hippo-repository Trunk Nightly/modules/org.onehippo.cms7$hippo-repository-handle-migration/builds/2013-09-16_04-16-58/archive/org.onehippo.cms7/hippo-repository-handle-migration/2.25.04-20130916.021814-4/hippo-repository-handle-migration-2.25.04-SNAPSHOT-sources.jar
[INFO]                                                                         
[INFO] ------------------------------------------------------------------------
[INFO] Building Repository Test 2.25.04-SNAPSHOT
[INFO] ------------------------------------------------------------------------
Downloading: http://maven.onehippo.com/maven2-snapshots/org/onehippo/cms7/hippo-repository-upgrade/2.25.04-SNAPSHOT/maven-metadata.xml
Downloaded: http://maven.onehippo.com/maven2-snapshots/org/onehippo/cms7/hippo-repository-upgrade/2.25.04-SNAPSHOT/maven-metadata.xml (624 B at 3.7 KB/sec)
Downloading: http://maven.onehippo.com/maven2-snapshots/org/onehippo/cms7/hippo-repository-upgrade/2.25.04-SNAPSHOT/hippo-repository-upgrade-2.25.04-SNAPSHOT.jar
projectFailed org.onehippo.cms7:hippo-repository-test:2.25.04-SNAPSHOT
[HUDSON] Archiving <https://builds.onehippo.org/job/hippo-repository%20Trunk%20Nightly/ws/test/pom.xml> to /var/hudson-data/jobs/hippo-repository Trunk Nightly/modules/org.onehippo.cms7$hippo-repository-test/builds/2013-09-16_04-16-58/archive/org.onehippo.cms7/hippo-repository-test/2.25.04-SNAPSHOT/pom.xml
sessionEnded
[INFO] ------------------------------------------------------------------------
[INFO] Reactor Summary:
[INFO] 
[INFO] Repository ........................................ SUCCESS [2.852s]
[INFO] Repository API .................................... SUCCESS [4.992s]
[INFO] Repository Utilities .............................. SUCCESS [3.424s]
[INFO] Repository Connector .............................. SUCCESS [5.232s]
[INFO] Repository Provider Module Interface .............. SUCCESS [3.336s]
[INFO] Repository Test Utilities ......................... SUCCESS [3.736s]
[INFO] Repository Builtin workflow ....................... SUCCESS [3.112s]
[INFO] Repository Engine ................................. SUCCESS [9.052s]
[INFO] Repository Default Configuration .................. SUCCESS [3.720s]
[INFO] Repository Modules ................................ SUCCESS [4.552s]
[INFO] Repository Test Content ........................... SUCCESS [0.804s]
[INFO] Repository Deprecated ............................. SUCCESS [1.104s]
[INFO] Repository Deprecated Facetselect Mirror .......... SUCCESS [4.108s]
[INFO] Repository workflow implementations ............... SUCCESS [5.100s]
[INFO] Repository Deprecated Translation ................. SUCCESS [4.176s]
[INFO] Repository Deprecated Facetsearch ................. SUCCESS [4.768s]
[INFO] Repository Upgrade ................................ SUCCESS [1.136s]
[INFO] Repository Handle Migration ....................... SUCCESS [4.308s]
[INFO] Repository Test ................................... FAILURE [0.280s]
[INFO] Repository LDAP based Authorization ............... SKIPPED
[INFO] Repository Resources .............................. SKIPPED
[INFO] Repository Servlets ............................... SKIPPED
[INFO] Repository Dependencies ........................... SKIPPED
[INFO] ------------------------------------------------------------------------
[INFO] BUILD FAILURE
[INFO] ------------------------------------------------------------------------
[INFO] Total time: 1:16.968s
[INFO] Finished at: Mon Sep 16 04:18:17 CEST 2013
[INFO] Final Memory: 16M/44M
[INFO] ------------------------------------------------------------------------
mavenExecutionResult exceptions not empty
org.apache.maven.lifecycle.LifecycleExecutionException: Failed to execute goal on project hippo-repository-test: Could not resolve dependencies for project org.onehippo.cms7:hippo-repository-test:jar:2.25.04-SNAPSHOT: Could not find artifact org.onehippo.cms7:hippo-repository-upgrade:jar:2.25.04-SNAPSHOT in hippo-maven2-snapshots (http://maven.onehippo.com/maven2-snapshots/)
	at org.apache.maven.lifecycle.internal.LifecycleDependencyResolver.getDependencies(LifecycleDependencyResolver.java:210)
	at org.apache.maven.lifecycle.internal.LifecycleDependencyResolver.resolveProjectDependencies(LifecycleDependencyResolver.java:117)
	at org.apache.maven.lifecycle.internal.MojoExecutor.ensureDependenciesAreResolved(MojoExecutor.java:258)
	at org.apache.maven.lifecycle.internal.MojoExecutor.execute(MojoExecutor.java:201)
	at org.apache.maven.lifecycle.internal.MojoExecutor.execute(MojoExecutor.java:153)
	at org.apache.maven.lifecycle.internal.MojoExecutor.execute(MojoExecutor.java:145)
	at org.apache.maven.lifecycle.internal.LifecycleModuleBuilder.buildProject(LifecycleModuleBuilder.java:84)
	at org.apache.maven.lifecycle.internal.LifecycleModuleBuilder.buildProject(LifecycleModuleBuilder.java:59)
	at org.apache.maven.lifecycle.internal.LifecycleStarter.singleThreadedBuild(LifecycleStarter.java:183)
	at org.apache.maven.lifecycle.internal.LifecycleStarter.execute(LifecycleStarter.java:161)
	at org.apache.maven.DefaultMaven.doExecute(DefaultMaven.java:320)
	at org.apache.maven.DefaultMaven.execute(DefaultMaven.java:156)
	at org.jvnet.hudson.maven3.launcher.Maven3Launcher.main(Maven3Launcher.java:79)
	at sun.reflect.NativeMethodAccessorImpl.invoke0(Native Method)
	at sun.reflect.NativeMethodAccessorImpl.invoke(NativeMethodAccessorImpl.java:39)
	at sun.reflect.DelegatingMethodAccessorImpl.invoke(DelegatingMethodAccessorImpl.java:25)
	at java.lang.reflect.Method.invoke(Method.java:597)
	at org.codehaus.plexus.classworlds.launcher.Launcher.launchStandard(Launcher.java:329)
	at org.codehaus.plexus.classworlds.launcher.Launcher.launch(Launcher.java:239)
	at org.jvnet.hudson.maven3.agent.Maven3Main.launch(Maven3Main.java:146)
	at hudson.maven.Maven3Builder.call(Maven3Builder.java:124)
	at hudson.maven.Maven3Builder.call(Maven3Builder.java:71)
	at hudson.remoting.UserRequest.perform(UserRequest.java:107)
	at hudson.remoting.UserRequest.perform(UserRequest.java:41)
	at hudson.remoting.Request$2.run(Request.java:276)
	at java.util.concurrent.Executors$RunnableAdapter.call(Executors.java:441)
	at java.util.concurrent.FutureTask$Sync.innerRun(FutureTask.java:303)
	at java.util.concurrent.FutureTask.run(FutureTask.java:138)
	at java.util.concurrent.ThreadPoolExecutor$Worker.runTask(ThreadPoolExecutor.java:886)
	at java.util.concurrent.ThreadPoolExecutor$Worker.run(ThreadPoolExecutor.java:908)
	at java.lang.Thread.run(Thread.java:662)
Caused by: org.apache.maven.project.DependencyResolutionException: Could not resolve dependencies for project org.onehippo.cms7:hippo-repository-test:jar:2.25.04-SNAPSHOT: Could not find artifact org.onehippo.cms7:hippo-repository-upgrade:jar:2.25.04-SNAPSHOT in hippo-maven2-snapshots (http://maven.onehippo.com/maven2-snapshots/)
	at org.apache.maven.project.DefaultProjectDependenciesResolver.resolve(DefaultProjectDependenciesResolver.java:189)
	at org.apache.maven.lifecycle.internal.LifecycleDependencyResolver.getDependencies(LifecycleDependencyResolver.java:185)
	... 30 more
Caused by: org.sonatype.aether.resolution.DependencyResolutionException: Could not find artifact org.onehippo.cms7:hippo-repository-upgrade:jar:2.25.04-SNAPSHOT in hippo-maven2-snapshots (http://maven.onehippo.com/maven2-snapshots/)
	at org.sonatype.aether.impl.internal.DefaultRepositorySystem.resolveDependencies(DefaultRepositorySystem.java:375)
	at org.apache.maven.project.DefaultProjectDependenciesResolver.resolve(DefaultProjectDependenciesResolver.java:183)
	... 31 more
Caused by: org.sonatype.aether.resolution.ArtifactResolutionException: Could not find artifact org.onehippo.cms7:hippo-repository-upgrade:jar:2.25.04-SNAPSHOT in hippo-maven2-snapshots (http://maven.onehippo.com/maven2-snapshots/)
	at org.sonatype.aether.impl.internal.DefaultArtifactResolver.resolve(DefaultArtifactResolver.java:538)
	at org.sonatype.aether.impl.internal.DefaultArtifactResolver.resolveArtifacts(DefaultArtifactResolver.java:216)
	at org.sonatype.aether.impl.internal.DefaultRepositorySystem.resolveDependencies(DefaultRepositorySystem.java:358)
	... 32 more
Caused by: org.sonatype.aether.transfer.ArtifactNotFoundException: Could not find artifact org.onehippo.cms7:hippo-repository-upgrade:jar:2.25.04-SNAPSHOT in hippo-maven2-snapshots (http://maven.onehippo.com/maven2-snapshots/)
	at org.sonatype.aether.connector.wagon.WagonRepositoryConnector$4.wrap(WagonRepositoryConnector.java:947)
	at org.sonatype.aether.connector.wagon.WagonRepositoryConnector$4.wrap(WagonRepositoryConnector.java:941)
	at org.sonatype.aether.connector.wagon.WagonRepositoryConnector$GetTask.run(WagonRepositoryConnector.java:669)
	at org.sonatype.aether.util.concurrency.RunnableErrorForwarder$1.run(RunnableErrorForwarder.java:60)
	... 3 more
Sending e-mails to: hippo-cms7-dev at lists.onehippo.org
channel stopped
Skipping sonar analysis due to bad build status FAILURE

--
This message is automatically generated by Hudson. 
For more information on Hudson, see: http://hudson-ci.org/


More information about the Hippo-cms7-dev mailing list