[Hippo-cms7-dev] [Hudson] Build failed in Hudson: hippo-packages Trunk Nightly #690

Hippo Public Hudson Server beheer at onehippo.com
Mon Sep 16 05:45:28 CEST 2013


See <https://builds.onehippo.org/job/hippo-packages%20Trunk%20Nightly/690/>

------------------------------------------
[...truncated 73 lines...]
[INFO] --- maven-remote-resources-plugin:1.4:process (default) @ hippo-package-app-dependencies ---
Downloading: http://maven.onehippo.com/maven2-snapshots/org/onehippo/cms7/hippo-repository-dependencies/2.25.04-SNAPSHOT/maven-metadata.xml
Downloaded: http://maven.onehippo.com/maven2-snapshots/org/onehippo/cms7/hippo-repository-dependencies/2.25.04-SNAPSHOT/maven-metadata.xml (629 B at 6.7 KB/sec)
Downloading: http://maven.onehippo.com/maven2-snapshots/org/onehippo/cms7/hippo-repository/2.25.04-SNAPSHOT/maven-metadata.xml
Downloaded: http://maven.onehippo.com/maven2-snapshots/org/onehippo/cms7/hippo-repository/2.25.04-SNAPSHOT/maven-metadata.xml (616 B at 8.8 KB/sec)
Downloading: http://maven.onehippo.com/maven2-snapshots/org/onehippo/cms7/hippo-cms7-project/24-SNAPSHOT/maven-metadata.xml
Downloaded: http://maven.onehippo.com/maven2-snapshots/org/onehippo/cms7/hippo-cms7-project/24-SNAPSHOT/maven-metadata.xml (608 B at 9.3 KB/sec)
Downloading: http://maven.onehippo.com/maven2-snapshots/org/onehippo/cms7/hippo-repository-builtin/2.25.04-SNAPSHOT/maven-metadata.xml
Downloaded: http://maven.onehippo.com/maven2-snapshots/org/onehippo/cms7/hippo-repository-builtin/2.25.04-SNAPSHOT/maven-metadata.xml (1017 B at 11.8 KB/sec)
Downloading: http://maven.onehippo.com/maven2-snapshots/org/onehippo/cms7/hippo-repository-api/2.25.04-SNAPSHOT/maven-metadata.xml
Downloaded: http://maven.onehippo.com/maven2-snapshots/org/onehippo/cms7/hippo-repository-api/2.25.04-SNAPSHOT/maven-metadata.xml (1013 B at 14.5 KB/sec)
Downloading: http://maven.onehippo.com/maven2-snapshots/org/onehippo/cms7/hippo-repository-engine/2.25.04-SNAPSHOT/maven-metadata.xml
Downloaded: http://maven.onehippo.com/maven2-snapshots/org/onehippo/cms7/hippo-repository-engine/2.25.04-SNAPSHOT/maven-metadata.xml (2 KB at 17.7 KB/sec)
Downloading: http://maven.onehippo.com/maven2-snapshots/org/onehippo/cms7/hippo-repository-connector/2.25.04-SNAPSHOT/maven-metadata.xml
Downloaded: http://maven.onehippo.com/maven2-snapshots/org/onehippo/cms7/hippo-repository-connector/2.25.04-SNAPSHOT/maven-metadata.xml (1019 B at 14.6 KB/sec)
Downloading: http://maven.onehippo.com/maven2-snapshots/org/onehippo/cms7/hippo-repository-utilities/2.25.04-SNAPSHOT/maven-metadata.xml
Downloaded: http://maven.onehippo.com/maven2-snapshots/org/onehippo/cms7/hippo-repository-utilities/2.25.04-SNAPSHOT/maven-metadata.xml (1019 B at 13.8 KB/sec)
Downloading: http://maven.onehippo.com/maven2-snapshots/org/onehippo/cms7/hippo-repository-provider/2.25.04-SNAPSHOT/maven-metadata.xml
Downloaded: http://maven.onehippo.com/maven2-snapshots/org/onehippo/cms7/hippo-repository-provider/2.25.04-SNAPSHOT/maven-metadata.xml (1018 B at 13.1 KB/sec)
Downloading: http://maven.onehippo.com/maven2-snapshots/org/onehippo/cms7/hippo-repository-modules/2.25.04-SNAPSHOT/maven-metadata.xml
Downloaded: http://maven.onehippo.com/maven2-snapshots/org/onehippo/cms7/hippo-repository-modules/2.25.04-SNAPSHOT/maven-metadata.xml (1017 B at 14.6 KB/sec)
Downloading: http://maven.onehippo.com/maven2-snapshots/org/onehippo/cms7/hippo-repository-config/2.25.04-SNAPSHOT/maven-metadata.xml
Downloaded: http://maven.onehippo.com/maven2-snapshots/org/onehippo/cms7/hippo-repository-config/2.25.04-SNAPSHOT/maven-metadata.xml (1016 B at 13.8 KB/sec)
Downloading: http://maven.onehippo.com/maven2-snapshots/org/onehippo/cms7/hippo-repository-servlets/2.25.04-SNAPSHOT/maven-metadata.xml
Downloaded: http://maven.onehippo.com/maven2-snapshots/org/onehippo/cms7/hippo-repository-servlets/2.25.04-SNAPSHOT/maven-metadata.xml (1018 B at 13.1 KB/sec)
Downloading: http://maven.onehippo.com/maven2-snapshots/org/onehippo/cms7/hippo-repository-workflow/2.25.04-SNAPSHOT/maven-metadata.xml
Downloaded: http://maven.onehippo.com/maven2-snapshots/org/onehippo/cms7/hippo-repository-workflow/2.25.04-SNAPSHOT/maven-metadata.xml (1018 B at 14.6 KB/sec)
Downloading: http://maven.onehippo.com/maven2-snapshots/org/onehippo/cms7/hippo-repository-resources/2.25.04-SNAPSHOT/maven-metadata.xml
Downloaded: http://maven.onehippo.com/maven2-snapshots/org/onehippo/cms7/hippo-repository-resources/2.25.04-SNAPSHOT/maven-metadata.xml (1019 B at 13.1 KB/sec)
Downloading: http://maven.onehippo.com/maven2-snapshots/org/onehippo/cms7/hippo-cms-shared-dependencies/2.25.03-SNAPSHOT/maven-metadata.xml
Downloaded: http://maven.onehippo.com/maven2-snapshots/org/onehippo/cms7/hippo-cms-shared-dependencies/2.25.03-SNAPSHOT/maven-metadata.xml (629 B at 5.3 KB/sec)
Downloading: http://maven.onehippo.com/maven2-snapshots/org/onehippo/cms7/hippo-cms/2.25.03-SNAPSHOT/maven-metadata.xml
Downloaded: http://maven.onehippo.com/maven2-snapshots/org/onehippo/cms7/hippo-cms/2.25.03-SNAPSHOT/maven-metadata.xml (609 B at 8.7 KB/sec)
Downloading: http://maven.onehippo.com/maven2-snapshots/org/onehippo/cms7/hippo-cms-editor-common/2.25.03-SNAPSHOT/maven-metadata.xml
Downloaded: http://maven.onehippo.com/maven2-snapshots/org/onehippo/cms7/hippo-cms-editor-common/2.25.03-SNAPSHOT/maven-metadata.xml (1016 B at 6.5 KB/sec)
Downloading: http://maven.onehippo.com/maven2-snapshots/org/onehippo/cms7/hippo-cms-editor/2.25.03-SNAPSHOT/maven-metadata.xml
Downloaded: http://maven.onehippo.com/maven2-snapshots/org/onehippo/cms7/hippo-cms-editor/2.25.03-SNAPSHOT/maven-metadata.xml (616 B at 7.9 KB/sec)
Downloading: http://maven.onehippo.com/maven2-snapshots/org/onehippo/cms7/hippo-cms-translation-common/2.25.03-SNAPSHOT/maven-metadata.xml
Downloaded: http://maven.onehippo.com/maven2-snapshots/org/onehippo/cms7/hippo-cms-translation-common/2.25.03-SNAPSHOT/maven-metadata.xml (1021 B at 13.8 KB/sec)
Downloading: http://maven.onehippo.com/maven2-snapshots/org/onehippo/cms7/hippo-cms-translation/2.25.03-SNAPSHOT/maven-metadata.xml
Downloaded: http://maven.onehippo.com/maven2-snapshots/org/onehippo/cms7/hippo-cms-translation/2.25.03-SNAPSHOT/maven-metadata.xml (621 B at 8.9 KB/sec)
Downloading: http://maven.onehippo.com/maven2-snapshots/org/onehippo/cms7/hippo-cms-brokenlinks-common/2.25.03-SNAPSHOT/maven-metadata.xml
Downloaded: http://maven.onehippo.com/maven2-snapshots/org/onehippo/cms7/hippo-cms-brokenlinks-common/2.25.03-SNAPSHOT/maven-metadata.xml (1021 B at 8.9 KB/sec)
Downloading: http://maven.onehippo.com/maven2-snapshots/org/onehippo/cms7/hippo-cms-brokenlinks/2.25.03-SNAPSHOT/maven-metadata.xml
Downloaded: http://maven.onehippo.com/maven2-snapshots/org/onehippo/cms7/hippo-cms-brokenlinks/2.25.03-SNAPSHOT/maven-metadata.xml (621 B at 5.2 KB/sec)
Downloading: http://maven.onehippo.com/maven2-snapshots/org/onehippo/cms7/hippo-cms-repository-dependencies/2.25.03-SNAPSHOT/maven-metadata.xml
Downloaded: http://maven.onehippo.com/maven2-snapshots/org/onehippo/cms7/hippo-cms-repository-dependencies/2.25.03-SNAPSHOT/maven-metadata.xml (633 B at 3.4 KB/sec)
Downloading: http://maven.onehippo.com/maven2-snapshots/org/onehippo/cms7/hippo-cms-types/2.25.03-SNAPSHOT/maven-metadata.xml
Downloaded: http://maven.onehippo.com/maven2-snapshots/org/onehippo/cms7/hippo-cms-types/2.25.03-SNAPSHOT/maven-metadata.xml (1008 B at 14.5 KB/sec)
Downloading: http://maven.onehippo.com/maven2-snapshots/org/onehippo/cms7/hippo-cms-config/2.25.03-SNAPSHOT/maven-metadata.xml
Downloaded: http://maven.onehippo.com/maven2-snapshots/org/onehippo/cms7/hippo-cms-config/2.25.03-SNAPSHOT/maven-metadata.xml (1009 B at 8.8 KB/sec)
Downloading: http://maven.onehippo.com/maven2-snapshots/org/onehippo/cms7/hippo-cms-gallery-repository/2.25.03-SNAPSHOT/maven-metadata.xml
Downloaded: http://maven.onehippo.com/maven2-snapshots/org/onehippo/cms7/hippo-cms-gallery-repository/2.25.03-SNAPSHOT/maven-metadata.xml (1021 B at 7.3 KB/sec)
Downloading: http://maven.onehippo.com/maven2-snapshots/org/onehippo/cms7/hippo-cms-gallery/2.25.03-SNAPSHOT/maven-metadata.xml
Downloaded: http://maven.onehippo.com/maven2-snapshots/org/onehippo/cms7/hippo-cms-gallery/2.25.03-SNAPSHOT/maven-metadata.xml (617 B at 7.2 KB/sec)
Downloading: http://maven.onehippo.com/maven2-snapshots/org/onehippo/cms7/hippo-cms-translation-repository/2.25.03-SNAPSHOT/maven-metadata.xml
Downloaded: http://maven.onehippo.com/maven2-snapshots/org/onehippo/cms7/hippo-cms-translation-repository/2.25.03-SNAPSHOT/maven-metadata.xml (2 KB at 8.9 KB/sec)
Downloading: http://maven.onehippo.com/maven2-snapshots/org/onehippo/cms7/hippo-cms-surf-repository/2.25.03-SNAPSHOT/maven-metadata.xml
Downloaded: http://maven.onehippo.com/maven2-snapshots/org/onehippo/cms7/hippo-cms-surf-repository/2.25.03-SNAPSHOT/maven-metadata.xml (1018 B at 6.5 KB/sec)
Downloading: http://maven.onehippo.com/maven2-snapshots/org/onehippo/cms7/hippo-cms-surf/2.25.03-SNAPSHOT/maven-metadata.xml
Downloaded: http://maven.onehippo.com/maven2-snapshots/org/onehippo/cms7/hippo-cms-surf/2.25.03-SNAPSHOT/maven-metadata.xml (614 B at 8.8 KB/sec)
Downloading: http://maven.onehippo.com/maven2-snapshots/org/onehippo/cms7/hippo-cms-workflow-repository/2.25.03-SNAPSHOT/maven-metadata.xml
Downloaded: http://maven.onehippo.com/maven2-snapshots/org/onehippo/cms7/hippo-cms-workflow-repository/2.25.03-SNAPSHOT/maven-metadata.xml (1022 B at 8.9 KB/sec)
Downloading: http://maven.onehippo.com/maven2-snapshots/org/onehippo/cms7/hippo-cms-workflow/2.25.03-SNAPSHOT/maven-metadata.xml
Downloaded: http://maven.onehippo.com/maven2-snapshots/org/onehippo/cms7/hippo-cms-workflow/2.25.03-SNAPSHOT/maven-metadata.xml (618 B at 2.7 KB/sec)
Downloading: http://maven.onehippo.com/maven2-snapshots/org/onehippo/cms7/hippo-cms-brokenlinks-repository/2.25.03-SNAPSHOT/maven-metadata.xml
Downloaded: http://maven.onehippo.com/maven2-snapshots/org/onehippo/cms7/hippo-cms-brokenlinks-repository/2.25.03-SNAPSHOT/maven-metadata.xml (2 KB at 8.3 KB/sec)
Downloading: http://maven.onehippo.com/maven2-snapshots/org/onehippo/cms7/hippo-cms-editor-repository/2.25.03-SNAPSHOT/maven-metadata.xml
Downloaded: http://maven.onehippo.com/maven2-snapshots/org/onehippo/cms7/hippo-cms-editor-repository/2.25.03-SNAPSHOT/maven-metadata.xml (2 KB at 17.7 KB/sec)
Downloading: http://maven.onehippo.com/maven2-snapshots/org/onehippo/cms7/hippo-cms-richtext-repository/2.25.03-SNAPSHOT/maven-metadata.xml
Downloaded: http://maven.onehippo.com/maven2-snapshots/org/onehippo/cms7/hippo-cms-richtext-repository/2.25.03-SNAPSHOT/maven-metadata.xml (1022 B at 6.9 KB/sec)
Downloading: http://maven.onehippo.com/maven2-snapshots/org/onehippo/cms7/hippo-cms-richtext/2.25.03-SNAPSHOT/maven-metadata.xml
Downloaded: http://maven.onehippo.com/maven2-snapshots/org/onehippo/cms7/hippo-cms-richtext/2.25.03-SNAPSHOT/maven-metadata.xml (618 B at 5.0 KB/sec)
Downloading: http://maven.onehippo.com/maven2-snapshots/org/onehippo/cms7/hippo-cms-reporting-repository/2.25.03-SNAPSHOT/maven-metadata.xml
Downloaded: http://maven.onehippo.com/maven2-snapshots/org/onehippo/cms7/hippo-cms-reporting-repository/2.25.03-SNAPSHOT/maven-metadata.xml (1023 B at 8.6 KB/sec)
Downloading: http://maven.onehippo.com/maven2-snapshots/org/onehippo/cms7/hippo-cms-reporting/2.25.03-SNAPSHOT/maven-metadata.xml
Downloaded: http://maven.onehippo.com/maven2-snapshots/org/onehippo/cms7/hippo-cms-reporting/2.25.03-SNAPSHOT/maven-metadata.xml (619 B at 5.0 KB/sec)
Downloading: http://maven.onehippo.com/maven2-snapshots/org/onehippo/cms7/hippo-cms-console-repository/2.25.03-SNAPSHOT/maven-metadata.xml
Downloaded: http://maven.onehippo.com/maven2-snapshots/org/onehippo/cms7/hippo-cms-console-repository/2.25.03-SNAPSHOT/maven-metadata.xml (1021 B at 10.0 KB/sec)
Downloading: http://maven.onehippo.com/maven2-snapshots/org/onehippo/cms7/hippo-cms-console/2.25.03-SNAPSHOT/maven-metadata.xml
Downloaded: http://maven.onehippo.com/maven2-snapshots/org/onehippo/cms7/hippo-cms-console/2.25.03-SNAPSHOT/maven-metadata.xml (617 B at 4.9 KB/sec)
Downloading: http://maven.onehippo.com/maven2-snapshots/org/onehippo/cms7/hippo-cms-automatic-export-repository/2.25.03-SNAPSHOT/maven-metadata.xml
Downloaded: http://maven.onehippo.com/maven2-snapshots/org/onehippo/cms7/hippo-cms-automatic-export-repository/2.25.03-SNAPSHOT/maven-metadata.xml (2 KB at 7.9 KB/sec)
Downloading: http://maven.onehippo.com/maven2-snapshots/org/onehippo/cms7/hippo-cms-automatic-export/2.25.03-SNAPSHOT/maven-metadata.xml
Downloaded: http://maven.onehippo.com/maven2-snapshots/org/onehippo/cms7/hippo-cms-automatic-export/2.25.03-SNAPSHOT/maven-metadata.xml (626 B at 5.5 KB/sec)
Downloading: http://maven.onehippo.com/maven2-snapshots/org/onehippo/cms7/hippo-repository-upgrade/2.25.04-SNAPSHOT/maven-metadata.xml
Downloaded: http://maven.onehippo.com/maven2-snapshots/org/onehippo/cms7/hippo-repository-upgrade/2.25.04-SNAPSHOT/maven-metadata.xml (624 B at 9.0 KB/sec)
Downloading: http://maven.onehippo.com/maven2-snapshots/org/onehippo/cms7/hippo-repository-upgrade/2.25.04-SNAPSHOT/hippo-repository-upgrade-2.25.04-SNAPSHOT.jar
mojoFailed org.apache.maven.plugins:maven-remote-resources-plugin:1.4(default)
projectFailed org.onehippo.cms7:hippo-package-app-dependencies:2.25.01-SNAPSHOT
[HUDSON] Archiving <https://builds.onehippo.org/job/hippo-packages%20Trunk%20Nightly/ws/package-app-dependencies/pom.xml> to /var/hudson-data/jobs/hippo-packages Trunk Nightly/modules/org.onehippo.cms7$hippo-package-app-dependencies/builds/2013-09-16_05-45-16/archive/org.onehippo.cms7/hippo-package-app-dependencies/2.25.01-SNAPSHOT/pom.xml
sessionEnded
[INFO] ------------------------------------------------------------------------
[INFO] Reactor Summary:
[INFO] 
[INFO] Hippo Product Packages ............................ SUCCESS [2.960s]
[INFO] Hippo Dependencies Package Applications ........... FAILURE [5.844s]
[INFO] Hippo Package CMS Dependencies .................... SKIPPED
[INFO] ------------------------------------------------------------------------
[INFO] BUILD FAILURE
[INFO] ------------------------------------------------------------------------
[INFO] Total time: 9.404s
[INFO] Finished at: Mon Sep 16 05:45:28 CEST 2013
[INFO] Final Memory: 9M/23M
[INFO] ------------------------------------------------------------------------
mavenExecutionResult exceptions not empty
org.apache.maven.lifecycle.LifecycleExecutionException: Failed to execute goal org.apache.maven.plugins:maven-remote-resources-plugin:1.4:process (default) on project hippo-package-app-dependencies: Failed to resolve dependencies for one or more projects in the reactor. Reason: Missing:
----------
1) org.onehippo.cms7:hippo-repository-upgrade:jar:2.25.04-SNAPSHOT

  Try downloading the file manually from the project website.

  Then, install it using the command: 
      mvn install:install-file -DgroupId=org.onehippo.cms7 -DartifactId=hippo-repository-upgrade -Dversion=2.25.04-SNAPSHOT -Dpackaging=jar -Dfile=/path/to/file

  Alternatively, if you host your own repository you can deploy the file there: 
      mvn deploy:deploy-file -DgroupId=org.onehippo.cms7 -DartifactId=hippo-repository-upgrade -Dversion=2.25.04-SNAPSHOT -Dpackaging=jar -Dfile=/path/to/file -Durl=[url] -DrepositoryId=[id]

  Path to dependency: 
  	1) org.onehippo.cms7:hippo-package-app-dependencies:pom:2.25.01-SNAPSHOT
  	2) org.onehippo.cms7:hippo-repository-upgrade:jar:2.25.04-SNAPSHOT

----------
1 required artifact is missing.

for artifact: 
  org.onehippo.cms7:hippo-package-app-dependencies:pom:2.25.01-SNAPSHOT

from the specified remote repositories:
  hippo-maven2-snapshots (http://maven.onehippo.com/maven2-snapshots/, releases=true, snapshots=true),
  hippo (http://maven.onehippo.com/maven2/, releases=true, snapshots=false),
  hippo-maven2 (http://maven.onehippo.com/maven2/, releases=true, snapshots=false),
  codehaus (https://nexus.codehaus.org/content/repositories/releases/org/codehaus/mojo, releases=false, snapshots=false),
  glassfish (http://download.java.net/maven/glassfish, releases=false, snapshots=false),
  openqa (http://nexus.openqa.org/content/repositories/releases, releases=false, snapshots=false),
  m2snapshots (http://people.apache.org/repo/m2-snapshot-repository, releases=false, snapshots=false),
  central (http://repo.maven.apache.org/maven2, releases=true, snapshots=false)

	at org.apache.maven.lifecycle.internal.MojoExecutor.execute(MojoExecutor.java:217)
	at org.apache.maven.lifecycle.internal.MojoExecutor.execute(MojoExecutor.java:153)
	at org.apache.maven.lifecycle.internal.MojoExecutor.execute(MojoExecutor.java:145)
	at org.apache.maven.lifecycle.internal.LifecycleModuleBuilder.buildProject(LifecycleModuleBuilder.java:84)
	at org.apache.maven.lifecycle.internal.LifecycleModuleBuilder.buildProject(LifecycleModuleBuilder.java:59)
	at org.apache.maven.lifecycle.internal.LifecycleStarter.singleThreadedBuild(LifecycleStarter.java:183)
	at org.apache.maven.lifecycle.internal.LifecycleStarter.execute(LifecycleStarter.java:161)
	at org.apache.maven.DefaultMaven.doExecute(DefaultMaven.java:320)
	at org.apache.maven.DefaultMaven.execute(DefaultMaven.java:156)
	at org.jvnet.hudson.maven3.launcher.Maven3Launcher.main(Maven3Launcher.java:79)
	at sun.reflect.NativeMethodAccessorImpl.invoke0(Native Method)
	at sun.reflect.NativeMethodAccessorImpl.invoke(NativeMethodAccessorImpl.java:39)
	at sun.reflect.DelegatingMethodAccessorImpl.invoke(DelegatingMethodAccessorImpl.java:25)
	at java.lang.reflect.Method.invoke(Method.java:597)
	at org.codehaus.plexus.classworlds.launcher.Launcher.launchStandard(Launcher.java:329)
	at org.codehaus.plexus.classworlds.launcher.Launcher.launch(Launcher.java:239)
	at org.jvnet.hudson.maven3.agent.Maven3Main.launch(Maven3Main.java:146)
	at hudson.maven.Maven3Builder.call(Maven3Builder.java:124)
	at hudson.maven.Maven3Builder.call(Maven3Builder.java:71)
	at hudson.remoting.UserRequest.perform(UserRequest.java:107)
	at hudson.remoting.UserRequest.perform(UserRequest.java:41)
	at hudson.remoting.Request$2.run(Request.java:276)
	at java.util.concurrent.Executors$RunnableAdapter.call(Executors.java:441)
	at java.util.concurrent.FutureTask$Sync.innerRun(FutureTask.java:303)
	at java.util.concurrent.FutureTask.run(FutureTask.java:138)
	at java.util.concurrent.ThreadPoolExecutor$Worker.runTask(ThreadPoolExecutor.java:886)
	at java.util.concurrent.ThreadPoolExecutor$Worker.run(ThreadPoolExecutor.java:908)
	at java.lang.Thread.run(Thread.java:662)
Caused by: org.apache.maven.plugin.MojoExecutionException: Failed to resolve dependencies for one or more projects in the reactor. Reason: Missing:
----------
1) org.onehippo.cms7:hippo-repository-upgrade:jar:2.25.04-SNAPSHOT

  Try downloading the file manually from the project website.

  Then, install it using the command: 
      mvn install:install-file -DgroupId=org.onehippo.cms7 -DartifactId=hippo-repository-upgrade -Dversion=2.25.04-SNAPSHOT -Dpackaging=jar -Dfile=/path/to/file

  Alternatively, if you host your own repository you can deploy the file there: 
      mvn deploy:deploy-file -DgroupId=org.onehippo.cms7 -DartifactId=hippo-repository-upgrade -Dversion=2.25.04-SNAPSHOT -Dpackaging=jar -Dfile=/path/to/file -Durl=[url] -DrepositoryId=[id]

  Path to dependency: 
  	1) org.onehippo.cms7:hippo-package-app-dependencies:pom:2.25.01-SNAPSHOT
  	2) org.onehippo.cms7:hippo-repository-upgrade:jar:2.25.04-SNAPSHOT

----------
1 required artifact is missing.

for artifact: 
  org.onehippo.cms7:hippo-package-app-dependencies:pom:2.25.01-SNAPSHOT

from the specified remote repositories:
  hippo-maven2-snapshots (http://maven.onehippo.com/maven2-snapshots/, releases=true, snapshots=true),
  hippo (http://maven.onehippo.com/maven2/, releases=true, snapshots=false),
  hippo-maven2 (http://maven.onehippo.com/maven2/, releases=true, snapshots=false),
  codehaus (https://nexus.codehaus.org/content/repositories/releases/org/codehaus/mojo, releases=false, snapshots=false),
  glassfish (http://download.java.net/maven/glassfish, releases=false, snapshots=false),
  openqa (http://nexus.openqa.org/content/repositories/releases, releases=false, snapshots=false),
  m2snapshots (http://people.apache.org/repo/m2-snapshot-repository, releases=false, snapshots=false),
  central (http://repo.maven.apache.org/maven2, releases=true, snapshots=false)

	at org.apache.maven.plugin.resources.remote.ProcessRemoteResourcesMojo.resolveProjectArtifacts(ProcessRemoteResourcesMojo.java:672)
	at org.apache.maven.plugin.resources.remote.ProcessRemoteResourcesMojo.getProjects(ProcessRemoteResourcesMojo.java:572)
	at org.apache.maven.plugin.resources.remote.ProcessRemoteResourcesMojo.configureVelocityContext(ProcessRemoteResourcesMojo.java:945)
	at org.apache.maven.plugin.resources.remote.ProcessRemoteResourcesMojo.execute(ProcessRemoteResourcesMojo.java:463)
	at org.apache.maven.plugin.DefaultBuildPluginManager.executeMojo(DefaultBuildPluginManager.java:101)
	at org.apache.maven.lifecycle.internal.MojoExecutor.execute(MojoExecutor.java:209)
	... 27 more
Caused by: org.apache.maven.artifact.resolver.MultipleArtifactsNotFoundException: Missing:
----------
1) org.onehippo.cms7:hippo-repository-upgrade:jar:2.25.04-SNAPSHOT

  Try downloading the file manually from the project website.

  Then, install it using the command: 
      mvn install:install-file -DgroupId=org.onehippo.cms7 -DartifactId=hippo-repository-upgrade -Dversion=2.25.04-SNAPSHOT -Dpackaging=jar -Dfile=/path/to/file

  Alternatively, if you host your own repository you can deploy the file there: 
      mvn deploy:deploy-file -DgroupId=org.onehippo.cms7 -DartifactId=hippo-repository-upgrade -Dversion=2.25.04-SNAPSHOT -Dpackaging=jar -Dfile=/path/to/file -Durl=[url] -DrepositoryId=[id]

  Path to dependency: 
  	1) org.onehippo.cms7:hippo-package-app-dependencies:pom:2.25.01-SNAPSHOT
  	2) org.onehippo.cms7:hippo-repository-upgrade:jar:2.25.04-SNAPSHOT

----------
1 required artifact is missing.

for artifact: 
  org.onehippo.cms7:hippo-package-app-dependencies:pom:2.25.01-SNAPSHOT

from the specified remote repositories:
  hippo-maven2-snapshots (http://maven.onehippo.com/maven2-snapshots/, releases=true, snapshots=true),
  hippo (http://maven.onehippo.com/maven2/, releases=true, snapshots=false),
  hippo-maven2 (http://maven.onehippo.com/maven2/, releases=true, snapshots=false),
  codehaus (https://nexus.codehaus.org/content/repositories/releases/org/codehaus/mojo, releases=false, snapshots=false),
  glassfish (http://download.java.net/maven/glassfish, releases=false, snapshots=false),
  openqa (http://nexus.openqa.org/content/repositories/releases, releases=false, snapshots=false),
  m2snapshots (http://people.apache.org/repo/m2-snapshot-repository, releases=false, snapshots=false),
  central (http://repo.maven.apache.org/maven2, releases=true, snapshots=false)

	at org.apache.maven.artifact.resolver.DefaultResolutionErrorHandler.throwErrors(DefaultResolutionErrorHandler.java:71)
	at org.apache.maven.artifact.resolver.DefaultArtifactResolver.resolveWithExceptions(DefaultArtifactResolver.java:326)
	at org.apache.maven.artifact.resolver.DefaultArtifactResolver.resolveTransitively(DefaultArtifactResolver.java:314)
	at org.apache.maven.artifact.resolver.DefaultArtifactResolver.resolveTransitively(DefaultArtifactResolver.java:293)
	at org.apache.maven.artifact.resolver.DefaultArtifactResolver.resolveTransitively(DefaultArtifactResolver.java:271)
	at org.apache.maven.shared.artifact.resolver.DefaultProjectDependenciesResolver.resolve(DefaultProjectDependenciesResolver.java:140)
	at org.apache.maven.shared.artifact.resolver.DefaultProjectDependenciesResolver.resolve(DefaultProjectDependenciesResolver.java:187)
	at org.apache.maven.plugin.resources.remote.ProcessRemoteResourcesMojo.resolveProjectArtifacts(ProcessRemoteResourcesMojo.java:666)
	... 32 more
Sending e-mails to: hippo-cms7-dev at lists.onehippo.org
channel stopped
Skipping sonar analysis due to bad build status FAILURE

--
This message is automatically generated by Hudson. 
For more information on Hudson, see: http://hudson-ci.org/


More information about the Hippo-cms7-dev mailing list