[Hippo-cms7-dev] [Hudson] Build failed in Hudson: GoGreen-trunk Nightly #763

Hippo Public Hudson Server beheer at onehippo.com
Wed Sep 18 06:01:21 CEST 2013


See <https://builds.onehippo.org/job/GoGreen-trunk%20Nightly/763/>

------------------------------------------
Started by timer
Cleaning up <https://builds.onehippo.org/job/GoGreen-trunk%20Nightly/ws/.>
Deleting <https://builds.onehippo.org/job/GoGreen-trunk%20Nightly/ws/target>
Updating http://svn.onehippo.org/repos/hippo/hippo-demos/hippo-go-green/trunk revision: Sep 18, 2013 6:01:01 AM depth:infinity ignoreExternals: false
At revision 40835
no change for http://svn.onehippo.org/repos/hippo/hippo-demos/hippo-go-green/trunk since the previous build
Found mavenVersion 3.0.4 from file jar:file:/home/hudson/software/maven/apache-maven-3.0-latest/lib/maven-core-3.0.4.jar!/META-INF/maven/org.apache.maven/maven-core/pom.properties
Parsing POMs
[workspace] $ /home/hudson/software/jvm/jdk1.6.0_latest/bin/java -Xmx256m -cp /var/hudson-data/plugins/maven-plugin/WEB-INF/lib/maven3-agent-2.2.2.jar:/home/hudson/software/maven/apache-maven-3.0-latest/boot/plexus-classworlds-2.4.jar org.jvnet.hudson.maven3.agent.Maven3Main /home/hudson/software/maven/apache-maven-3.0-latest /var/hudson-data/war/webapp/WEB-INF/lib/hudson-remoting-3.0.0.jar /var/hudson-data/plugins/maven-plugin/WEB-INF/lib/maven3-interceptor-2.2.2.jar 37684
<===[HUDSON REMOTING CAPACITY]===>   channel started
Executing Maven:  -B -f <https://builds.onehippo.org/job/GoGreen-trunk%20Nightly/ws/pom.xml> -e -Dsurefire.useFile=false -U clean deploy -Dhippo.snapshots -DskipTests -Ppedantic
[INFO] Error stacktraces are turned on.
[INFO] Scanning for projects...
Downloading: http://maven.onehippo.com/maven2-snapshots/org/onehippo/cms7/hippo-cms7-release/7.9.0-SNAPSHOT/maven-metadata.xml
Downloaded: http://maven.onehippo.com/maven2-snapshots/org/onehippo/cms7/hippo-cms7-release/7.9.0-SNAPSHOT/maven-metadata.xml (614 B at 2.9 KB/sec)
Downloading: http://maven.onehippo.com/maven2-snapshots/org/onehippo/cms7/hippo-cms7-project/24-SNAPSHOT/maven-metadata.xml
Downloaded: http://maven.onehippo.com/maven2-snapshots/org/onehippo/cms7/hippo-cms7-project/24-SNAPSHOT/maven-metadata.xml (608 B at 8.2 KB/sec)
[INFO] ------------------------------------------------------------------------
[INFO] Reactor Build Order:
[INFO] 
[INFO] Hippo Go Green
[INFO] Hippo Go Green Content
[INFO] Hippo Go Green Rating Plugin
[INFO] Hippo Go Green CMS
[INFO] Hippo Go Green Site Assembly
[INFO] Hippo Go Green Site
[INFO] Hippo Go Green Integration Tests
[INFO] Hippo Go Green Server Configurations
[INFO] Hippo Go Green Test Server Configuration
[INFO] Hippo Go Green Acct Server Configuration
[INFO] Hippo Go Green Prod Server Configuration
[INFO] Hippo Go Green Distribution
[INFO]                                                                         
[INFO] ------------------------------------------------------------------------
[INFO] Building Hippo Go Green 3.08.00-SNAPSHOT
[INFO] ------------------------------------------------------------------------
[INFO] 
[INFO] --- maven-clean-plugin:2.5:clean (default-clean) @ hippogogreen ---
[INFO] 
[INFO] --- apache-rat-plugin:0.9.RAT125:check (default) @ hippogogreen ---
[INFO] Exclude: **/*.cnd
[INFO] Exclude: **/*.json
[INFO] Exclude: **/*.log
[INFO] Exclude: **/*.patch
[INFO] Exclude: **/*.properties
[INFO] Exclude: **/hippoecm-extension.xml
[INFO] Exclude: **/log4j.dtd
[INFO] Exclude: **/MANIFEST.MF
[INFO] Exclude: **/*.iml
[INFO] Exclude: **/atlassian-ide-plugin.xml
[INFO] Exclude: cms/src/main/resources/skin/js/jquery.tools.overlay.min.js
[INFO] Exclude: dist/src/overlay/tomcat/webapps/ROOT/css/reset-fonts-grids.css
[INFO] Exclude: dist/src/overlay/tomcat/webapps/ROOT/css/base-edited.css
[INFO] Exclude: site/src/main/resources/META-INF/hst/security/skin/js/jquery-1.4.2.min.js
[INFO] Exclude: site/src/main/resources/META-INF/hst/security/skin/js/jquery.tools.min.js
[INFO] Exclude: site/src/main/webapp/css/facebook/yui-css.css
[INFO] Exclude: site/src/main/webapp/css/mobile/yui-css.css
[INFO] Exclude: site/src/main/webapp/css/yui-css.css
[INFO] Exclude: site/src/main/webapp/css/jquery-ui-1.10.3.custom.css
[INFO] Exclude: site/src/main/webapp/js/formcheck/formcheck.js
[INFO] Exclude: site/src/main/webapp/js/galleryview-2.1.1/**
[INFO] Exclude: site/src/main/webapp/js/json2.js
[INFO] Exclude: site/src/main/webapp/js/jquery-1.4.2.min.js
[INFO] Exclude: site/src/main/webapp/js/jquery-1.9.1.js
[INFO] Exclude: site/src/main/webapp/js/jquery.mb.browser.min.js
[INFO] Exclude: site/src/main/webapp/js/jquery.ui.core.js
[INFO] Exclude: site/src/main/webapp/js/jquery.ui.datepicker.js
[INFO] Exclude: site/src/main/webapp/js/jquery-ui-1.8.2.custom.min.js
[INFO] Exclude: site/src/main/webapp/js/jquery.localscroll-1.2.7-min.js
[INFO] Exclude: site/src/main/webapp/js/jquery.scrollTo-1.4.2-min.js
[INFO] Exclude: site/src/main/webapp/js/jquery.serialScroll-1.2.2-min.js
[INFO] Exclude: site/src/main/webapp/js/jquery.tools.min.js
[INFO] Exclude: site/src/main/webapp/js/jquery.validate.min.js
[INFO] Exclude: site/src/main/webapp/js/mootools-1.2.4-core-nc.js
[INFO] Exclude: site/src/main/webapp/js/mootools-1.2.4-core.js
[INFO] Exclude: site/src/main/webapp/js/syntaxhighlighter_3.0.83/**
[INFO] Exclude: etc/dependencies/*
[INFO] Exclude: dist/src/overlay/tomcat/bin/*
[INFO] Exclude: content/src/main/resources/**/*.xml
[INFO] Exclude: server-config/acct-server-config/src/main/resources/**/*.xml
[INFO] Exclude: server-config/prod-server-config/src/main/resources/**/*.xml
[INFO] Exclude: server-config/test-server-config/src/main/resources/**/*.xml
mojoFailed org.apache.rat:apache-rat-plugin:0.9.RAT125(default)
projectFailed com.onehippo.gogreen:hippogogreen:3.08.00-SNAPSHOT
[HUDSON] Archiving <https://builds.onehippo.org/job/GoGreen-trunk%20Nightly/ws/pom.xml> to /var/hudson-data/jobs/GoGreen-trunk Nightly/modules/com.onehippo.gogreen$hippogogreen/builds/2013-09-18_06-01-10/archive/com.onehippo.gogreen/hippogogreen/3.08.00-SNAPSHOT/pom.xml
sessionEnded
[INFO] ------------------------------------------------------------------------
[INFO] Reactor Summary:
[INFO] 
[INFO] Hippo Go Green .................................... FAILURE [6.056s]
[INFO] Hippo Go Green Content ............................ SKIPPED
[INFO] Hippo Go Green Rating Plugin ...................... SKIPPED
[INFO] Hippo Go Green CMS ................................ SKIPPED
[INFO] Hippo Go Green Site Assembly ...................... SKIPPED
[INFO] Hippo Go Green Site ............................... SKIPPED
[INFO] Hippo Go Green Integration Tests .................. SKIPPED
[INFO] Hippo Go Green Server Configurations .............. SKIPPED
[INFO] Hippo Go Green Test Server Configuration .......... SKIPPED
[INFO] Hippo Go Green Acct Server Configuration .......... SKIPPED
[INFO] Hippo Go Green Prod Server Configuration .......... SKIPPED
[INFO] Hippo Go Green Distribution ....................... SKIPPED
[INFO] ------------------------------------------------------------------------
[INFO] BUILD FAILURE
[INFO] ------------------------------------------------------------------------
[INFO] Total time: 7.384s
[INFO] Finished at: Wed Sep 18 06:01:19 CEST 2013
[INFO] Final Memory: 9M/21M
[INFO] ------------------------------------------------------------------------
mavenExecutionResult exceptions not empty
org.apache.maven.lifecycle.LifecycleExecutionException: Failed to execute goal org.apache.rat:apache-rat-plugin:0.9.RAT125:check (default) on project hippogogreen: Too many unapproved licenses: 1
	at org.apache.maven.lifecycle.internal.MojoExecutor.execute(MojoExecutor.java:213)
	at org.apache.maven.lifecycle.internal.MojoExecutor.execute(MojoExecutor.java:153)
	at org.apache.maven.lifecycle.internal.MojoExecutor.execute(MojoExecutor.java:145)
	at org.apache.maven.lifecycle.internal.LifecycleModuleBuilder.buildProject(LifecycleModuleBuilder.java:84)
	at org.apache.maven.lifecycle.internal.LifecycleModuleBuilder.buildProject(LifecycleModuleBuilder.java:59)
	at org.apache.maven.lifecycle.internal.LifecycleStarter.singleThreadedBuild(LifecycleStarter.java:183)
	at org.apache.maven.lifecycle.internal.LifecycleStarter.execute(LifecycleStarter.java:161)
	at org.apache.maven.DefaultMaven.doExecute(DefaultMaven.java:320)
	at org.apache.maven.DefaultMaven.execute(DefaultMaven.java:156)
	at org.jvnet.hudson.maven3.launcher.Maven3Launcher.main(Maven3Launcher.java:79)
	at sun.reflect.NativeMethodAccessorImpl.invoke0(Native Method)
	at sun.reflect.NativeMethodAccessorImpl.invoke(NativeMethodAccessorImpl.java:39)
	at sun.reflect.DelegatingMethodAccessorImpl.invoke(DelegatingMethodAccessorImpl.java:25)
	at java.lang.reflect.Method.invoke(Method.java:597)
	at org.codehaus.plexus.classworlds.launcher.Launcher.launchStandard(Launcher.java:329)
	at org.codehaus.plexus.classworlds.launcher.Launcher.launch(Launcher.java:239)
	at org.jvnet.hudson.maven3.agent.Maven3Main.launch(Maven3Main.java:146)
	at hudson.maven.Maven3Builder.call(Maven3Builder.java:124)
	at hudson.maven.Maven3Builder.call(Maven3Builder.java:71)
	at hudson.remoting.UserRequest.perform(UserRequest.java:107)
	at hudson.remoting.UserRequest.perform(UserRequest.java:41)
	at hudson.remoting.Request$2.run(Request.java:276)
	at java.util.concurrent.Executors$RunnableAdapter.call(Executors.java:441)
	at java.util.concurrent.FutureTask$Sync.innerRun(FutureTask.java:303)
	at java.util.concurrent.FutureTask.run(FutureTask.java:138)
	at java.util.concurrent.ThreadPoolExecutor$Worker.runTask(ThreadPoolExecutor.java:886)
	at java.util.concurrent.ThreadPoolExecutor$Worker.run(ThreadPoolExecutor.java:908)
	at java.lang.Thread.run(Thread.java:662)
Caused by: org.apache.rat.mp.RatCheckException: Too many unapproved licenses: 1
	at org.apache.rat.mp.RatCheckMojo.check(RatCheckMojo.java:181)
	at org.apache.rat.mp.RatCheckMojo.execute(RatCheckMojo.java:171)
	at org.apache.maven.plugin.DefaultBuildPluginManager.executeMojo(DefaultBuildPluginManager.java:101)
	at org.apache.maven.lifecycle.internal.MojoExecutor.execute(MojoExecutor.java:209)
	... 27 more
Sending e-mails to: hippo-cms7-dev at lists.onehippo.org
channel stopped
Skipping sonar analysis due to bad build status FAILURE

--
This message is automatically generated by Hudson. 
For more information on Hudson, see: http://hudson-ci.org/


More information about the Hippo-cms7-dev mailing list