[Hippo-cms7-dev] [Hudson] Build failed in Hudson: hippo-cms Trunk » CMS Editor Test #2611

Hippo Public Hudson Server beheer at onehippo.com
Tue Sep 24 12:44:32 CEST 2013


See <https://builds.onehippo.org/job/hippo-cms%20Trunk/org.onehippo.cms7$hippo-cms-editor-test/2611/>

------------------------------------------
[HUDSON] Archiving /var/hudson-data/jobs/hippo-cms Trunk/workspace/editor/frontend/pom.xml to /var/hudson-data/jobs/hippo-cms Trunk/modules/org.onehippo.cms7$hippo-cms-editor-frontend/builds/2013-09-24_12-37-24/archive/org.onehippo.cms7/hippo-cms-editor-frontend/2.25.03-SNAPSHOT/pom.xml
[HUDSON] Archiving /var/hudson-data/jobs/hippo-cms Trunk/workspace/editor/frontend/target/hippo-cms-editor-frontend-2.25.03-SNAPSHOT.jar to /var/hudson-data/jobs/hippo-cms Trunk/modules/org.onehippo.cms7$hippo-cms-editor-frontend/builds/2013-09-24_12-37-24/archive/org.onehippo.cms7/hippo-cms-editor-frontend/2.25.03-SNAPSHOT/hippo-cms-editor-frontend-2.25.03-SNAPSHOT.jar
[HUDSON] Archiving /var/hudson-data/jobs/hippo-cms Trunk/workspace/editor/frontend/target/hippo-cms-editor-frontend-2.25.03-SNAPSHOT-sources.jar to /var/hudson-data/jobs/hippo-cms Trunk/modules/org.onehippo.cms7$hippo-cms-editor-frontend/builds/2013-09-24_12-37-24/archive/org.onehippo.cms7/hippo-cms-editor-frontend/2.25.03-SNAPSHOT/hippo-cms-editor-frontend-2.25.03-SNAPSHOT-sources.jar
[INFO]                                                                         
[INFO] ------------------------------------------------------------------------
[INFO] Building CMS Editor Test 2.25.03-SNAPSHOT
[INFO] ------------------------------------------------------------------------
[INFO] 
[INFO] --- maven-clean-plugin:2.5:clean (default-clean) @ hippo-cms-editor-test ---
[INFO] 
[INFO] --- maven-remote-resources-plugin:1.4:process (default) @ hippo-cms-editor-test ---
[INFO] Using 'UTF-8' encoding to copy filtered resources.
[INFO] skip non existing resourceDirectory <https://builds.onehippo.org/job/hippo-cms%20Trunk/org.onehippo.cms7$hippo-cms-editor-test/ws/src/main/resources>
[INFO] Copying 3 resources
[INFO] 
[INFO] --- maven-resources-plugin:2.6:resources (default-resources) @ hippo-cms-editor-test ---
[INFO] 
[INFO] --- maven-compiler-plugin:2.5.1:compile (default-compile) @ hippo-cms-editor-test ---
[INFO] No sources to compile
[INFO] 
[INFO] --- maven-resources-plugin:2.6:testResources (default-testResources) @ hippo-cms-editor-test ---
[INFO] Using 'UTF-8' encoding to copy filtered resources.
[INFO] Copying 8 resources
[INFO] Copying 7 resources
[INFO] Copying 3 resources
[INFO] [INFO] Compiling 19 source files to <https://builds.onehippo.org/job/hippo-cms%20Trunk/org.onehippo.cms7$hippo-cms-editor-test/ws/target/test-classes>

[INFO] --- maven-compiler-plugin:2.5.1:testCompile (default-testCompile) @ hippo-cms-editor-test ---
[INFO] -------------------------------------------------------------
mojoFailed org.apache.maven.plugins:maven-compiler-plugin:2.5.1(default-testCompile)
[ERROR] COMPILATION ERROR : 
[INFO] -------------------------------------------------------------
[ERROR] <https://builds.onehippo.org/job/hippo-cms%20Trunk/org.onehippo.cms7$hippo-cms-editor-test/ws/src/test/java/org/hippoecm/frontend/editor/workflow/NamespaceWorkflowPluginTest.java>:[111,13] error: cannot find symbol
[ERROR]   symbol: method teardown()
<https://builds.onehippo.org/job/hippo-cms%20Trunk/org.onehippo.cms7$hippo-cms-editor-test/ws/src/test/java/org/hippoecm/frontend/editor/workflow/NamespaceWorkflowPluginTest.java>:[109,4] error: method does not override or implement a method from a supertype
[INFO] 2 errors 
[INFO] -------------------------------------------------------------
projectFailed org.onehippo.cms7:hippo-cms-editor-test:2.25.03-SNAPSHOT

--
This message is automatically generated by Hudson. 
For more information on Hudson, see: http://hudson-ci.org/


More information about the Hippo-cms7-dev mailing list