[Hippo-cms7-dev] [Hudson] Build failed in Hudson: Repository Integration Trunk #683

Hippo Integration Hudson Server beheer at onehippo.com
Wed Sep 25 16:49:32 CEST 2013


See <https://integration.onehippo.com/job/Repository%20Integration%20Trunk/683/changes>

Changes:

[Jannis Bloemendal] REPO-768 Improve the FolderWorkflow so it is capable of reordering same name siblings

Forward-Port

[Unico Hommes] REPO-765 remove debug logging

[Frank van Lankvelt] REPO-765: include spi-commons version explicitly for downstream projects

[Unico Hommes] REPO-769 add bootstrap instruction hippo:contentpropdelete to delete properties during initialization

[Frank van Lankvelt] REPO-765: set executed flag in tests

[Frank van Lankvelt] REPO-765: properties are not always returned in the same order

[Frank van Lankvelt] REPO-765: dump config tree before & after test, if there's a difference

[aschrijvers] REPO-1 trivial

------------------------------------------
[...truncated 816 lines...]
	at org.apache.maven.surefire.junit4.JUnit4Provider.executeTestSet(JUnit4Provider.java:141)
	at org.apache.maven.surefire.junit4.JUnit4Provider.invoke(JUnit4Provider.java:112)
	at sun.reflect.NativeMethodAccessorImpl.invoke0(Native Method)
	at sun.reflect.NativeMethodAccessorImpl.invoke(NativeMethodAccessorImpl.java:57)
	at sun.reflect.DelegatingMethodAccessorImpl.invoke(DelegatingMethodAccessorImpl.java:43)
	at java.lang.reflect.Method.invoke(Method.java:601)
	at org.apache.maven.surefire.util.ReflectionUtils.invokeMethodWithArray(ReflectionUtils.java:189)
	at org.apache.maven.surefire.booter.ProviderFactory$ProviderProxy.invoke(ProviderFactory.java:165)
	at org.apache.maven.surefire.booter.ProviderFactory.invokeProvider(ProviderFactory.java:85)
	at org.apache.maven.surefire.booter.ForkedBooter.runSuitesInProcess(ForkedBooter.java:115)
	at org.apache.maven.surefire.booter.ForkedBooter.main(ForkedBooter.java:75)
25.09.2013 16:41:49 ERROR [org.hippoecm.repository.impl.InitializationProcessorImpl.initializeNodecontent():997] Error initializing content for types/testcontent-type-news.xml in '/hippo:namespaces/testcontent' : javax.jcr.InvalidSerializedDataException: illegal property name: hippostdpubwf:createdBy
25.09.2013 16:41:49 ERROR [org.hippoecm.repository.impl.InitializationProcessorImpl.initializeNodecontent():997] Error initializing content for testcontent-data.xml in '/' : javax.jcr.InvalidSerializedDataException: illegal property name: hippostdpubwf:createdBy
25.09.2013 16:41:49 ERROR [org.hippoecm.repository.impl.InitializationProcessorImpl.initializeNodecontent():997] Error initializing content for testcontent-image-example.xml in '/content/gallery' : javax.jcr.InvalidSerializedDataException: illegal node type name: hippogallery:stdImageGallery
25.09.2013 16:41:49 ERROR [org.hippoecm.repository.impl.InitializationProcessorImpl.initializeNodecontent():997] Error initializing content for testcontent-asset-example.xml in '/content/assets' : javax.jcr.InvalidSerializedDataException: illegal node type name: hippogallery:stdAssetGallery
Tests run: 1, Failures: 0, Errors: 0, Skipped: 0, Time elapsed: 14.992 sec
Running org.hippoecm.repository.FacetSelectPerformanceTest
Tests run: 1, Failures: 0, Errors: 0, Skipped: 1, Time elapsed: 0 sec
Running org.hippoecm.repository.CanonicalPathTest
Tests run: 4, Failures: 0, Errors: 0, Skipped: 0, Time elapsed: 1.736 sec
Running org.hippoecm.repository.FacetSelectTest
25.09.2013 16:41:53 WARN  [org.apache.jackrabbit.core.state.ItemStateReferenceCache.cache():178] overwriting cached entry cafebabe-cafe-babe-cafe-babecafebabe
25.09.2013 16:41:53 WARN  [org.apache.jackrabbit.core.state.ItemStateReferenceCache.cache():178] overwriting cached entry cafebabe-cafe-babe-cafe-babecafebabe
25.09.2013 16:41:53 WARN  [org.apache.jackrabbit.core.state.ItemStateReferenceCache.cache():178] overwriting cached entry cafebabe-cafe-babe-cafe-babecafebabe
25.09.2013 16:41:53 WARN  [org.apache.jackrabbit.core.state.ItemStateReferenceCache.cache():178] overwriting cached entry cafebabe-cafe-babe-cafe-babecafebabe
25.09.2013 16:41:53 WARN  [org.apache.jackrabbit.core.state.ItemStateReferenceCache.cache():178] overwriting cached entry cafebabe-cafe-babe-cafe-babecafebabe
25.09.2013 16:41:53 WARN  [org.apache.jackrabbit.core.state.ItemStateReferenceCache.cache():178] overwriting cached entry cafebabe-cafe-babe-cafe-babecafebabe
25.09.2013 16:41:53 WARN  [org.apache.jackrabbit.core.state.ItemStateReferenceCache.cache():178] overwriting cached entry cafebabe-cafe-babe-cafe-babecafebabe
25.09.2013 16:41:53 WARN  [org.apache.jackrabbit.core.state.ItemStateReferenceCache.cache():178] overwriting cached entry cafebabe-cafe-babe-cafe-babecafebabe
25.09.2013 16:41:53 WARN  [org.apache.jackrabbit.core.state.ItemStateReferenceCache.cache():178] overwriting cached entry cafebabe-cafe-babe-cafe-babecafebabe
25.09.2013 16:41:53 WARN  [org.apache.jackrabbit.core.ItemManager.getDefinition():225] Fallback to nt:unstructured due to unknown child node definition for type '{internal}root'
25.09.2013 16:41:53 WARN  [org.apache.jackrabbit.core.ItemManager.getDefinition():225] Fallback to nt:unstructured due to unknown child node definition for type '{internal}root'
25.09.2013 16:41:53 WARN  [org.apache.jackrabbit.core.ItemManager.getDefinition():225] Fallback to nt:unstructured due to unknown child node definition for type '{internal}root'
25.09.2013 16:41:53 WARN  [org.apache.jackrabbit.core.ItemManager.getDefinition():225] Fallback to nt:unstructured due to unknown child node definition for type '{internal}root'
25.09.2013 16:41:55 WARN  [org.hippoecm.repository.jackrabbit.MirrorVirtualProvider.populate():218] Mirror of facetselect is not allowed to have as docbase the uuid of another mirror or facetselect.
25.09.2013 16:41:55 WARN  [org.apache.jackrabbit.core.state.ItemStateReferenceCache.cache():178] overwriting cached entry cafebabe-cafe-babe-cafe-babecafebabe
25.09.2013 16:41:55 WARN  [org.apache.jackrabbit.core.state.ItemStateReferenceCache.cache():178] overwriting cached entry cafebabe-cafe-babe-cafe-babecafebabe
25.09.2013 16:41:55 WARN  [org.apache.jackrabbit.core.state.ItemStateReferenceCache.cache():178] overwriting cached entry cafebabe-cafe-babe-cafe-babecafebabe
25.09.2013 16:41:55 WARN  [org.apache.jackrabbit.core.state.ItemStateReferenceCache.cache():178] overwriting cached entry cafebabe-cafe-babe-cafe-babecafebabe
25.09.2013 16:41:55 WARN  [org.apache.jackrabbit.core.state.ItemStateReferenceCache.cache():178] overwriting cached entry cafebabe-cafe-babe-cafe-babecafebabe
25.09.2013 16:41:55 WARN  [org.apache.jackrabbit.core.state.ItemStateReferenceCache.cache():178] overwriting cached entry cafebabe-cafe-babe-cafe-babecafebabe
25.09.2013 16:41:55 WARN  [org.apache.jackrabbit.core.state.ItemStateReferenceCache.cache():178] overwriting cached entry cafebabe-cafe-babe-cafe-babecafebabe
25.09.2013 16:41:55 WARN  [org.apache.jackrabbit.core.ItemManager.getDefinition():225] Fallback to nt:unstructured due to unknown child node definition for type '{internal}root'
25.09.2013 16:41:56 WARN  [org.apache.jackrabbit.core.state.ItemStateReferenceCache.cache():178] overwriting cached entry cafebabe-cafe-babe-cafe-babecafebabe
Tests run: 12, Failures: 0, Errors: 0, Skipped: 0, Time elapsed: 3.596 sec

Results :

Tests run: 18, Failures: 0, Errors: 0, Skipped: 1

[INFO] 
[INFO] --- maven-jar-plugin:2.4:jar (default-jar) @ hippo-repository-deprecated-facetselectmirror ---
[INFO] Building jar: <https://integration.onehippo.com/job/Repository%20Integration%20Trunk/ws/deprecated/facetselectmirror/target/hippo-repository-deprecated-facetselectmirror-2.25.04-SNAPSHOT.jar>
[INFO] 
[INFO] --- maven-source-plugin:2.2.1:jar-no-fork (attach-sources) @ hippo-repository-deprecated-facetselectmirror ---
[INFO] Building jar: <https://integration.onehippo.com/job/Repository%20Integration%20Trunk/ws/deprecated/facetselectmirror/target/hippo-repository-deprecated-facetselectmirror-2.25.04-SNAPSHOT-sources.jar>
[INFO]                                                                         
[INFO] ------------------------------------------------------------------------
[INFO] Building Repository workflow implementations 2.25.04-SNAPSHOT
[INFO] ------------------------------------------------------------------------
[INFO] 
[INFO] --- maven-clean-plugin:2.4.1:clean (default-clean) @ hippo-repository-workflow ---
[INFO] Deleting <https://integration.onehippo.com/job/Repository%20Integration%20Trunk/ws/workflow/target>
[INFO] 
[INFO] --- maven-remote-resources-plugin:1.4:process (default) @ hippo-repository-workflow ---
[INFO] 
[INFO] --- maven-resources-plugin:2.6:resources (default-resources) @ hippo-repository-workflow ---
[INFO] Using 'UTF-8' encoding to copy filtered resources.
[INFO] Copying 16 resources
[INFO] Copying 3 resources
[INFO] 
[INFO] --- maven-compiler-plugin:2.5.1:compile (default-compile) @ hippo-repository-workflow ---
[INFO] Compiling 13 source files to <https://integration.onehippo.com/job/Repository%20Integration%20Trunk/ws/workflow/target/classes>
[INFO] 
[INFO] --- maven-resources-plugin:2.6:testResources (default-testResources) @ hippo-repository-workflow ---
[INFO] Using 'UTF-8' encoding to copy filtered resources.
[INFO] Copying 10 resources
[INFO] Copying 3 resources
[INFO] 
[INFO] --- maven-compiler-plugin:2.5.1:testCompile (default-testCompile) @ hippo-repository-workflow ---
[INFO] Compiling 9 source files to <https://integration.onehippo.com/job/Repository%20Integration%20Trunk/ws/workflow/target/test-classes>
[INFO] 
[INFO] --- maven-surefire-plugin:2.12.4:test (default-test) @ hippo-repository-workflow ---
[INFO] Surefire report directory: <https://integration.onehippo.com/job/Repository%20Integration%20Trunk/ws/workflow/target/surefire-reports>

-------------------------------------------------------
 T E S T S
-------------------------------------------------------

-------------------------------------------------------
 T E S T S
-------------------------------------------------------
Running org.hippoecm.repository.CopyTest
Tests run: 10, Failures: 0, Errors: 0, Skipped: 0, Time elapsed: 18.268 sec
Running org.hippoecm.repository.reviewedactions.ReviewedActionsWorkflowTest
Tests run: 5, Failures: 0, Errors: 0, Skipped: 0, Time elapsed: 18.252 sec
Running org.hippoecm.repository.reviewedactions.VersioningWorkflowTest
Tests run: 1, Failures: 0, Errors: 0, Skipped: 0, Time elapsed: 19.476 sec
Running org.hippoecm.repository.reviewedactions.FailingWorkflowTest
Tests run: 1, Failures: 0, Errors: 0, Skipped: 0, Time elapsed: 15.904 sec
Running org.hippoecm.repository.reviewedactions.WorkflowAuthorizationTest
Tests run: 2, Failures: 0, Errors: 0, Skipped: 0, Time elapsed: 17.52 sec
Running org.hippoecm.faceteddate.DerivedDateTest
Tests run: 3, Failures: 0, Errors: 0, Skipped: 0, Time elapsed: 14.344 sec

Results :

Tests run: 22, Failures: 0, Errors: 0, Skipped: 0

[INFO] 
[INFO] --- maven-jar-plugin:2.4:jar (default-jar) @ hippo-repository-workflow ---
[INFO] Building jar: <https://integration.onehippo.com/job/Repository%20Integration%20Trunk/ws/workflow/target/hippo-repository-workflow-2.25.04-SNAPSHOT.jar>
[INFO] 
[INFO] --- maven-source-plugin:2.2.1:jar-no-fork (attach-sources) @ hippo-repository-workflow ---
[INFO] Building jar: <https://integration.onehippo.com/job/Repository%20Integration%20Trunk/ws/workflow/target/hippo-repository-workflow-2.25.04-SNAPSHOT-sources.jar>
[INFO] 
[INFO] --- maven-failsafe-plugin:2.16:integration-test (integration-test) @ hippo-repository-workflow ---
[INFO] Failsafe report directory: <https://integration.onehippo.com/job/Repository%20Integration%20Trunk/ws/workflow/target/failsafe-reports>

-------------------------------------------------------
 T E S T S
-------------------------------------------------------
Running org.hippoecm.repository.reviewedactions.AcceptRequestTest
Tests run: 2, Failures: 0, Errors: 0, Skipped: 0, Time elapsed: 334.592 sec - in org.hippoecm.repository.reviewedactions.AcceptRequestTest
Running org.hippoecm.repository.translation.TranslationWorkflowTest
Tests run: 4, Failures: 0, Errors: 1, Skipped: 0, Time elapsed: 10.404 sec <<< FAILURE! - in org.hippoecm.repository.translation.TranslationWorkflowTest
testFolderWorkflowCreatesNewDocumentThatInheritsLocale(org.hippoecm.repository.translation.TranslationWorkflowTest)  Time elapsed: 0.484 sec  <<< ERROR!
java.lang.Exception: Configuration has been changed, but not reverted; make sure changes in tearDown overrides are saved.  Detected changes: added = [], changed = [hippo:queries, hippo:workflows], removed = [].  Use RepositoryTestCase#setConfigurationChangeDebugPath to narrow down.
	at org.onehippo.repository.testutils.RepositoryTestCase.checkState(RepositoryTestCase.java:250)
	at org.onehippo.repository.testutils.RepositoryTestCase.tearDown(RepositoryTestCase.java:177)
	at org.onehippo.repository.testutils.RepositoryTestCase.tearDown(RepositoryTestCase.java:167)
	at sun.reflect.NativeMethodAccessorImpl.invoke0(Native Method)
	at sun.reflect.NativeMethodAccessorImpl.invoke(NativeMethodAccessorImpl.java:57)
	at sun.reflect.DelegatingMethodAccessorImpl.invoke(DelegatingMethodAccessorImpl.java:43)
	at java.lang.reflect.Method.invoke(Method.java:601)
	at org.junit.internal.runners.MethodRoadie.runAfters(MethodRoadie.java:138)
	at org.junit.internal.runners.MethodRoadie.runBeforesThenTestThenAfters(MethodRoadie.java:92)
	at org.junit.internal.runners.MethodRoadie.runTest(MethodRoadie.java:77)
	at org.junit.internal.runners.MethodRoadie.run(MethodRoadie.java:42)
	at org.junit.internal.runners.JUnit4ClassRunner.invokeTestMethod(JUnit4ClassRunner.java:88)
	at org.junit.internal.runners.JUnit4ClassRunner.runMethods(JUnit4ClassRunner.java:51)
	at org.junit.internal.runners.JUnit4ClassRunner$1.run(JUnit4ClassRunner.java:44)
	at org.junit.internal.runners.ClassRoadie.runUnprotected(ClassRoadie.java:27)
	at org.junit.internal.runners.ClassRoadie.runProtected(ClassRoadie.java:37)
	at org.junit.internal.runners.JUnit4ClassRunner.run(JUnit4ClassRunner.java:42)
	at org.apache.maven.surefire.junit4.JUnit4Provider.execute(JUnit4Provider.java:264)
	at org.apache.maven.surefire.junit4.JUnit4Provider.executeTestSet(JUnit4Provider.java:153)
	at org.apache.maven.surefire.junit4.JUnit4Provider.invoke(JUnit4Provider.java:124)
	at org.apache.maven.surefire.booter.ForkedBooter.invokeProviderInSameClassLoader(ForkedBooter.java:200)
	at org.apache.maven.surefire.booter.ForkedBooter.runSuitesInProcess(ForkedBooter.java:153)
	at org.apache.maven.surefire.booter.ForkedBooter.main(ForkedBooter.java:103)


Results :

Tests in error: 
  TranslationWorkflowTest>RepositoryTestCase.tearDown:167->RepositoryTestCase.tearDown:177->RepositoryTestCase.checkState:250 ? 

Tests run: 6, Failures: 0, Errors: 1, Skipped: 0

[WARNING] File encoding has not been set, using platform encoding ANSI_X3.4-1968, i.e. build is platform dependent!
[INFO] 
[INFO] --- maven-failsafe-plugin:2.16:verify (integration-test) @ hippo-repository-workflow ---
[INFO] Failsafe report directory: <https://integration.onehippo.com/job/Repository%20Integration%20Trunk/ws/workflow/target/failsafe-reports>
[WARNING] File encoding has not been set, using platform encoding ANSI_X3.4-1968, i.e. build is platform dependent!
[INFO] ------------------------------------------------------------------------
[INFO] Reactor Summary:
[INFO] 
[INFO] Repository ........................................ SUCCESS [2.388s]
[INFO] Repository API .................................... SUCCESS [4.308s]
[INFO] Repository Utilities .............................. SUCCESS [1.856s]
[INFO] Repository Connector .............................. SUCCESS [3.284s]
[INFO] Repository Provider Module Interface .............. SUCCESS [1.684s]
[INFO] Repository Test Utilities ......................... SUCCESS [3.160s]
[INFO] Repository Builtin workflow ....................... SUCCESS [1.060s]
[INFO] Repository Engine ................................. SUCCESS [2:11.164s]
[INFO] Repository Default Configuration .................. SUCCESS [25.608s]
[INFO] Repository Modules ................................ SUCCESS [26.040s]
[INFO] Repository Test Content ........................... SUCCESS [0.188s]
[INFO] Repository Deprecated ............................. SUCCESS [0.084s]
[INFO] Repository Deprecated Facetselect Mirror .......... SUCCESS [22.800s]
[INFO] Repository workflow implementations ............... FAILURE [7:35.520s]
[INFO] Repository Deprecated Translation ................. SKIPPED
[INFO] Repository Deprecated Facetsearch ................. SKIPPED
[INFO] Repository Upgrade Module ......................... SKIPPED
[INFO] Repository Upgrade ................................ SKIPPED
[INFO] Repository Handle Migration ....................... SKIPPED
[INFO] Repository Test ................................... SKIPPED
[INFO] Repository LDAP based Authorization ............... SKIPPED
[INFO] Repository Resources .............................. SKIPPED
[INFO] Repository Servlets ............................... SKIPPED
[INFO] Repository Dependencies ........................... SKIPPED
[INFO] ------------------------------------------------------------------------
[INFO] BUILD FAILURE
[INFO] ------------------------------------------------------------------------
[INFO] Total time: 11:21.928s
[INFO] Finished at: Wed Sep 25 16:49:32 CEST 2013
[INFO] Final Memory: 20M/196M
[INFO] ------------------------------------------------------------------------
[INFO] o.h.m.e.h.MavenExecutionResultHandler - Build failed with exception(s)
[INFO] o.h.m.e.h.MavenExecutionResultHandler - [1] org.apache.maven.lifecycle.LifecycleExecutionException: Failed to execute goal org.apache.maven.plugins:maven-failsafe-plugin:2.16:verify (integration-test) on project hippo-repository-workflow: There are test failures.

Please refer to <https://integration.onehippo.com/job/Repository%20Integration%20Trunk/ws/workflow/target/failsafe-reports> for the individual test results.
[DEBUG] Closing connection to remote
[ERROR] Failed to execute goal org.apache.maven.plugins:maven-failsafe-plugin:2.16:verify (integration-test) on project hippo-repository-workflow: There are test failures.
[ERROR] 
[ERROR] Please refer to <https://integration.onehippo.com/job/Repository%20Integration%20Trunk/ws/workflow/target/failsafe-reports> for the individual test results.
[ERROR] -> [Help 1]
org.apache.maven.lifecycle.LifecycleExecutionException: Failed to execute goal org.apache.maven.plugins:maven-failsafe-plugin:2.16:verify (integration-test) on project hippo-repository-workflow: There are test failures.

Please refer to <https://integration.onehippo.com/job/Repository%20Integration%20Trunk/ws/workflow/target/failsafe-reports> for the individual test results.
	at org.apache.maven.lifecycle.internal.MojoExecutor.execute(MojoExecutor.java:213)
	at org.apache.maven.lifecycle.internal.MojoExecutor.execute(MojoExecutor.java:153)
	at org.apache.maven.lifecycle.internal.MojoExecutor.execute(MojoExecutor.java:145)
	at org.apache.maven.lifecycle.internal.LifecycleModuleBuilder.buildProject(LifecycleModuleBuilder.java:84)
	at org.apache.maven.lifecycle.internal.LifecycleModuleBuilder.buildProject(LifecycleModuleBuilder.java:59)
	at org.apache.maven.lifecycle.internal.LifecycleStarter.singleThreadedBuild(LifecycleStarter.java:183)
	at org.apache.maven.lifecycle.internal.LifecycleStarter.execute(LifecycleStarter.java:161)
	at org.apache.maven.DefaultMaven.doExecute(DefaultMaven.java:319)
	at org.apache.maven.DefaultMaven.execute(DefaultMaven.java:156)
	at org.apache.maven.cli.MavenCli.execute(MavenCli.java:537)
	at org.apache.maven.cli.MavenCli.doMain(MavenCli.java:196)
	at org.apache.maven.cli.MavenCli.main(MavenCli.java:141)
	at sun.reflect.NativeMethodAccessorImpl.invoke0(Native Method)
	at sun.reflect.NativeMethodAccessorImpl.invoke(NativeMethodAccessorImpl.java:57)
	at sun.reflect.DelegatingMethodAccessorImpl.invoke(DelegatingMethodAccessorImpl.java:43)
	at java.lang.reflect.Method.invoke(Method.java:601)
	at org.codehaus.plexus.classworlds.launcher.Launcher.launchEnhanced(Launcher.java:290)
	at org.codehaus.plexus.classworlds.launcher.Launcher.launch(Launcher.java:230)
	at org.codehaus.plexus.classworlds.launcher.Launcher.mainWithExitCode(Launcher.java:409)
	at org.codehaus.plexus.classworlds.launcher.Launcher.main(Launcher.java:352)
Caused by: org.apache.maven.plugin.MojoFailureException: There are test failures.

Please refer to <https://integration.onehippo.com/job/Repository%20Integration%20Trunk/ws/workflow/target/failsafe-reports> for the individual test results.
	at org.apache.maven.plugin.surefire.SurefireHelper.reportExecution(SurefireHelper.java:82)
	at org.apache.maven.plugin.failsafe.VerifyMojo.execute(VerifyMojo.java:194)
	at org.apache.maven.plugin.DefaultBuildPluginManager.executeMojo(DefaultBuildPluginManager.java:101)
	at org.apache.maven.lifecycle.internal.MojoExecutor.execute(MojoExecutor.java:209)
	... 19 more
[ERROR] 
[ERROR] Re-run Maven using the -X switch to enable full debug logging.
[ERROR] 
[ERROR] For more information about the errors and possible solutions, please read the following articles:
[ERROR] [Help 1] http://cwiki.apache.org/confluence/display/MAVEN/MojoFailureException
[ERROR] 
[ERROR] After correcting the problems, you can resume the build with the command
[ERROR]   mvn <goals> -rf :hippo-repository-workflow
[DEBUG] Waiting for process to finish
[DEBUG] Result: 1

--
This message is automatically generated by Hudson. 
For more information on Hudson, see: http://hudson-ci.org/


More information about the Hippo-cms7-dev mailing list