[Hippo-cms7-dev] [Hudson] Build failed in Hudson: Hippo Search Service Trunk #175

Unico Hommes u.hommes at onehippo.com
Fri Sep 27 10:03:41 CEST 2013


That one was removed in 7.9. Probably a custom repository.xml for the tests
that still uses it.

--
Unico


On Fri, Sep 27, 2013 at 9:32 AM, Mathijs den Burger <
m.denburger at onehippo.com> wrote:

> The Hippo Search Service build fails on a ClassNotFoundException for
>
> org.hippoecm.repository.jackrabbit.persistence.ForkedDerbyPersistenceManager.
> Does anyone have a clue?
>
> Mathijs
>
>
> On Fri, Sep 27, 2013 at 4:13 AM, Hippo Public Hudson Server
> <beheer at onehippo.com> wrote:
> > See <
> https://builds.onehippo.org/job/Hippo%20Search%20Service%20Trunk/175/>
> >
> > ------------------------------------------
> > [...truncated 1689 lines...]
> >         at
> org.hippoecm.repository.LocalHippoRepository$LocalRepositoryImpl.<init>(LocalHippoRepository.java:206)
> >         at
> org.hippoecm.repository.LocalHippoRepository.initializeStartup(LocalHippoRepository.java:265)
> >         at
> org.hippoecm.repository.LocalHippoRepository.initialize(LocalHippoRepository.java:226)
> >         at
> org.hippoecm.repository.LocalHippoRepository.create(LocalHippoRepository.java:127)
> >         ... 37 more
> > Caused by: org.apache.jackrabbit.core.config.ConfigurationException:
> Configured bean implementation class
> org.hippoecm.repository.jackrabbit.persistence.ForkedDerbyPersistenceManager
> was not found.
> >         at
> org.apache.jackrabbit.core.config.SimpleBeanFactory.newInstance(SimpleBeanFactory.java:44)
> >         at
> org.apache.jackrabbit.core.config.BeanConfig.newInstance(BeanConfig.java:191)
> >         at
> org.apache.jackrabbit.core.RepositoryImpl.createPersistenceManager(RepositoryImpl.java:1340)
> >         ... 44 more
> > Caused by: java.lang.ClassNotFoundException:
> org.hippoecm.repository.jackrabbit.persistence.ForkedDerbyPersistenceManager
> >         at java.net.URLClassLoader$1.run(URLClassLoader.java:366)
> >         at java.net.URLClassLoader$1.run(URLClassLoader.java:355)
> >         at java.security.AccessController.doPrivileged(Native Method)
> >         at java.net.URLClassLoader.findClass(URLClassLoader.java:354)
> >         at java.lang.ClassLoader.loadClass(ClassLoader.java:423)
> >         at sun.misc.Launcher$AppClassLoader.loadClass(Launcher.java:308)
> >         at java.lang.ClassLoader.loadClass(ClassLoader.java:356)
> >         at java.lang.Class.forName0(Native Method)
> >         at java.lang.Class.forName(Class.java:264)
> >         at
> org.apache.jackrabbit.core.config.SimpleBeanFactory.newInstance(SimpleBeanFactory.java:30)
> >         ... 46 more
> >
> >
> testPersist(org.onehippo.cms7.services.search.jcr.service.TestHippoJcrSearchService)
>  Time elapsed: 0.052 sec  <<< ERROR!
> > javax.jcr.RepositoryException:
> java.lang.reflect.InvocationTargetException
> >         at
> org.hippoecm.repository.HippoRepositoryFactory.getHippoRepository(HippoRepositoryFactory.java:79)
> >         at
> org.onehippo.repository.testutils.RepositoryTestCase.setUp(RepositoryTestCase.java:153)
> >         at
> org.onehippo.repository.testutils.RepositoryTestCase.setUp(RepositoryTestCase.java:133)
> >         at
> org.onehippo.cms7.services.search.jcr.service.TestHippoJcrSearchService.setUp(TestHippoJcrSearchService.java:51)
> >         at sun.reflect.NativeMethodAccessorImpl.invoke0(Native Method)
> >         at
> sun.reflect.NativeMethodAccessorImpl.invoke(NativeMethodAccessorImpl.java:57)
> >         at
> sun.reflect.DelegatingMethodAccessorImpl.invoke(DelegatingMethodAccessorImpl.java:43)
> >         at java.lang.reflect.Method.invoke(Method.java:601)
> >         at
> org.junit.runners.model.FrameworkMethod$1.runReflectiveCall(FrameworkMethod.java:44)
> >         at
> org.junit.internal.runners.model.ReflectiveCallable.run(ReflectiveCallable.java:15)
> >         at
> org.junit.runners.model.FrameworkMethod.invokeExplosively(FrameworkMethod.java:41)
> >         at
> org.junit.internal.runners.statements.RunBefores.evaluate(RunBefores.java:27)
> >         at
> org.junit.internal.runners.statements.RunAfters.evaluate(RunAfters.java:31)
> >         at
> org.junit.runners.BlockJUnit4ClassRunner.runChild(BlockJUnit4ClassRunner.java:73)
> >         at
> org.junit.runners.BlockJUnit4ClassRunner.runChild(BlockJUnit4ClassRunner.java:46)
> >         at
> org.junit.runners.ParentRunner.runChildren(ParentRunner.java:180)
> >         at
> org.junit.runners.ParentRunner.access$000(ParentRunner.java:41)
> >         at
> org.junit.runners.ParentRunner$1.evaluate(ParentRunner.java:173)
> >         at
> org.junit.internal.runners.statements.RunBefores.evaluate(RunBefores.java:28)
> >         at
> org.junit.internal.runners.statements.RunAfters.evaluate(RunAfters.java:31)
> >         at org.junit.runners.ParentRunner.run(ParentRunner.java:220)
> >         at
> org.apache.maven.surefire.junit4.JUnit4Provider.execute(JUnit4Provider.java:252)
> >         at
> org.apache.maven.surefire.junit4.JUnit4Provider.executeTestSet(JUnit4Provider.java:141)
> >         at
> org.apache.maven.surefire.junit4.JUnit4Provider.invoke(JUnit4Provider.java:112)
> >         at sun.reflect.NativeMethodAccessorImpl.invoke0(Native Method)
> >         at
> sun.reflect.NativeMethodAccessorImpl.invoke(NativeMethodAccessorImpl.java:57)
> >         at
> sun.reflect.DelegatingMethodAccessorImpl.invoke(DelegatingMethodAccessorImpl.java:43)
> >         at java.lang.reflect.Method.invoke(Method.java:601)
> >         at
> org.apache.maven.surefire.util.ReflectionUtils.invokeMethodWithArray(ReflectionUtils.java:189)
> >         at
> org.apache.maven.surefire.booter.ProviderFactory$ProviderProxy.invoke(ProviderFactory.java:165)
> >         at
> org.apache.maven.surefire.booter.ProviderFactory.invokeProvider(ProviderFactory.java:85)
> >         at
> org.apache.maven.surefire.booter.ForkedBooter.runSuitesInProcess(ForkedBooter.java:115)
> >         at
> org.apache.maven.surefire.booter.ForkedBooter.main(ForkedBooter.java:75)
> > Caused by: java.lang.reflect.InvocationTargetException
> >         at sun.reflect.NativeMethodAccessorImpl.invoke0(Native Method)
> >         at
> sun.reflect.NativeMethodAccessorImpl.invoke(NativeMethodAccessorImpl.java:57)
> >         at
> sun.reflect.DelegatingMethodAccessorImpl.invoke(DelegatingMethodAccessorImpl.java:43)
> >         at java.lang.reflect.Method.invoke(Method.java:601)
> >         at
> org.hippoecm.repository.HippoRepositoryFactory.getHippoRepository(HippoRepositoryFactory.java:75)
> >         ... 32 more
> > Caused by: javax.jcr.RepositoryException: Cannot instantiate persistence
> manager
> org.hippoecm.repository.jackrabbit.persistence.ForkedDerbyPersistenceManager
> >         at
> org.apache.jackrabbit.core.RepositoryImpl.createPersistenceManager(RepositoryImpl.java:1353)
> >         at
> org.apache.jackrabbit.core.RepositoryImpl.createVersionManager(RepositoryImpl.java:486)
> >         at
> org.apache.jackrabbit.core.RepositoryImpl.<init>(RepositoryImpl.java:311)
> >         at
> org.hippoecm.repository.jackrabbit.RepositoryImpl.<init>(RepositoryImpl.java:78)
> >         at
> org.hippoecm.repository.LocalHippoRepository$LocalRepositoryImpl.<init>(LocalHippoRepository.java:206)
> >         at
> org.hippoecm.repository.LocalHippoRepository.initializeStartup(LocalHippoRepository.java:265)
> >         at
> org.hippoecm.repository.LocalHippoRepository.initialize(LocalHippoRepository.java:226)
> >         at
> org.hippoecm.repository.LocalHippoRepository.create(LocalHippoRepository.java:127)
> >         ... 37 more
> > Caused by: org.apache.jackrabbit.core.config.ConfigurationException:
> Configured bean implementation class
> org.hippoecm.repository.jackrabbit.persistence.ForkedDerbyPersistenceManager
> was not found.
> >         at
> org.apache.jackrabbit.core.config.SimpleBeanFactory.newInstance(SimpleBeanFactory.java:44)
> >         at
> org.apache.jackrabbit.core.config.BeanConfig.newInstance(BeanConfig.java:191)
> >         at
> org.apache.jackrabbit.core.RepositoryImpl.createPersistenceManager(RepositoryImpl.java:1340)
> >         ... 44 more
> > Caused by: java.lang.ClassNotFoundException:
> org.hippoecm.repository.jackrabbit.persistence.ForkedDerbyPersistenceManager
> >         at java.net.URLClassLoader$1.run(URLClassLoader.java:366)
> >         at java.net.URLClassLoader$1.run(URLClassLoader.java:355)
> >         at java.security.AccessController.doPrivileged(Native Method)
> >         at java.net.URLClassLoader.findClass(URLClassLoader.java:354)
> >         at java.lang.ClassLoader.loadClass(ClassLoader.java:423)
> >         at sun.misc.Launcher$AppClassLoader.loadClass(Launcher.java:308)
> >         at java.lang.ClassLoader.loadClass(ClassLoader.java:356)
> >         at java.lang.Class.forName0(Native Method)
> >         at java.lang.Class.forName(Class.java:264)
> >         at
> org.apache.jackrabbit.core.config.SimpleBeanFactory.newInstance(SimpleBeanFactory.java:30)
> >         ... 46 more
> >
> >
> testPersistRetrieve(org.onehippo.cms7.services.search.jcr.service.TestHippoJcrSearchService)
>  Time elapsed: 0.044 sec  <<< ERROR!
> > javax.jcr.RepositoryException:
> java.lang.reflect.InvocationTargetException
> >         at
> org.hippoecm.repository.HippoRepositoryFactory.getHippoRepository(HippoRepositoryFactory.java:79)
> >         at
> org.onehippo.repository.testutils.RepositoryTestCase.setUp(RepositoryTestCase.java:153)
> >         at
> org.onehippo.repository.testutils.RepositoryTestCase.setUp(RepositoryTestCase.java:133)
> >         at
> org.onehippo.cms7.services.search.jcr.service.TestHippoJcrSearchService.setUp(TestHippoJcrSearchService.java:51)
> >         at sun.reflect.NativeMethodAccessorImpl.invoke0(Native Method)
> >         at
> sun.reflect.NativeMethodAccessorImpl.invoke(NativeMethodAccessorImpl.java:57)
> >         at
> sun.reflect.DelegatingMethodAccessorImpl.invoke(DelegatingMethodAccessorImpl.java:43)
> >         at java.lang.reflect.Method.invoke(Method.java:601)
> >         at
> org.junit.runners.model.FrameworkMethod$1.runReflectiveCall(FrameworkMethod.java:44)
> >         at
> org.junit.internal.runners.model.ReflectiveCallable.run(ReflectiveCallable.java:15)
> >         at
> org.junit.runners.model.FrameworkMethod.invokeExplosively(FrameworkMethod.java:41)
> >         at
> org.junit.internal.runners.statements.RunBefores.evaluate(RunBefores.java:27)
> >         at
> org.junit.internal.runners.statements.RunAfters.evaluate(RunAfters.java:31)
> >         at
> org.junit.runners.BlockJUnit4ClassRunner.runChild(BlockJUnit4ClassRunner.java:73)
> >         at
> org.junit.runners.BlockJUnit4ClassRunner.runChild(BlockJUnit4ClassRunner.java:46)
> >         at
> org.junit.runners.ParentRunner.runChildren(ParentRunner.java:180)
> >         at
> org.junit.runners.ParentRunner.access$000(ParentRunner.java:41)
> >         at
> org.junit.runners.ParentRunner$1.evaluate(ParentRunner.java:173)
> >         at
> org.junit.internal.runners.statements.RunBefores.evaluate(RunBefores.java:28)
> >         at
> org.junit.internal.runners.statements.RunAfters.evaluate(RunAfters.java:31)
> >         at org.junit.runners.ParentRunner.run(ParentRunner.java:220)
> >         at
> org.apache.maven.surefire.junit4.JUnit4Provider.execute(JUnit4Provider.java:252)
> >         at
> org.apache.maven.surefire.junit4.JUnit4Provider.executeTestSet(JUnit4Provider.java:141)
> >         at
> org.apache.maven.surefire.junit4.JUnit4Provider.invoke(JUnit4Provider.java:112)
> >         at sun.reflect.NativeMethodAccessorImpl.invoke0(Native Method)
> >         at
> sun.reflect.NativeMethodAccessorImpl.invoke(NativeMethodAccessorImpl.java:57)
> >         at
> sun.reflect.DelegatingMethodAccessorImpl.invoke(DelegatingMethodAccessorImpl.java:43)
> >         at java.lang.reflect.Method.invoke(Method.java:601)
> >         at
> org.apache.maven.surefire.util.ReflectionUtils.invokeMethodWithArray(ReflectionUtils.java:189)
> >         at
> org.apache.maven.surefire.booter.ProviderFactory$ProviderProxy.invoke(ProviderFactory.java:165)
> >         at
> org.apache.maven.surefire.booter.ProviderFactory.invokeProvider(ProviderFactory.java:85)
> >         at
> org.apache.maven.surefire.booter.ForkedBooter.runSuitesInProcess(ForkedBooter.java:115)
> >         at
> org.apache.maven.surefire.booter.ForkedBooter.main(ForkedBooter.java:75)
> > Caused by: java.lang.reflect.InvocationTargetException
> >         at sun.reflect.NativeMethodAccessorImpl.invoke0(Native Method)
> >         at
> sun.reflect.NativeMethodAccessorImpl.invoke(NativeMethodAccessorImpl.java:57)
> >         at
> sun.reflect.DelegatingMethodAccessorImpl.invoke(DelegatingMethodAccessorImpl.java:43)
> >         at java.lang.reflect.Method.invoke(Method.java:601)
> >         at
> org.hippoecm.repository.HippoRepositoryFactory.getHippoRepository(HippoRepositoryFactory.java:75)
> >         ... 32 more
> > Caused by: javax.jcr.RepositoryException: Cannot instantiate persistence
> manager
> org.hippoecm.repository.jackrabbit.persistence.ForkedDerbyPersistenceManager
> >         at
> org.apache.jackrabbit.core.RepositoryImpl.createPersistenceManager(RepositoryImpl.java:1353)
> >         at
> org.apache.jackrabbit.core.RepositoryImpl.createVersionManager(RepositoryImpl.java:486)
> >         at
> org.apache.jackrabbit.core.RepositoryImpl.<init>(RepositoryImpl.java:311)
> >         at
> org.hippoecm.repository.jackrabbit.RepositoryImpl.<init>(RepositoryImpl.java:78)
> >         at
> org.hippoecm.repository.LocalHippoRepository$LocalRepositoryImpl.<init>(LocalHippoRepository.java:206)
> >         at
> org.hippoecm.repository.LocalHippoRepository.initializeStartup(LocalHippoRepository.java:265)
> >         at
> org.hippoecm.repository.LocalHippoRepository.initialize(LocalHippoRepository.java:226)
> >         at
> org.hippoecm.repository.LocalHippoRepository.create(LocalHippoRepository.java:127)
> >         ... 37 more
> > Caused by: org.apache.jackrabbit.core.config.ConfigurationException:
> Configured bean implementation class
> org.hippoecm.repository.jackrabbit.persistence.ForkedDerbyPersistenceManager
> was not found.
> >         at
> org.apache.jackrabbit.core.config.SimpleBeanFactory.newInstance(SimpleBeanFactory.java:44)
> >         at
> org.apache.jackrabbit.core.config.BeanConfig.newInstance(BeanConfig.java:191)
> >         at
> org.apache.jackrabbit.core.RepositoryImpl.createPersistenceManager(RepositoryImpl.java:1340)
> >         ... 44 more
> > Caused by: java.lang.ClassNotFoundException:
> org.hippoecm.repository.jackrabbit.persistence.ForkedDerbyPersistenceManager
> >         at java.net.URLClassLoader$1.run(URLClassLoader.java:366)
> >         at java.net.URLClassLoader$1.run(URLClassLoader.java:355)
> >         at java.security.AccessController.doPrivileged(Native Method)
> >         at java.net.URLClassLoader.findClass(URLClassLoader.java:354)
> >         at java.lang.ClassLoader.loadClass(ClassLoader.java:423)
> >         at sun.misc.Launcher$AppClassLoader.loadClass(Launcher.java:308)
> >         at java.lang.ClassLoader.loadClass(ClassLoader.java:356)
> >         at java.lang.Class.forName0(Native Method)
> >         at java.lang.Class.forName(Class.java:264)
> >         at
> org.apache.jackrabbit.core.config.SimpleBeanFactory.newInstance(SimpleBeanFactory.java:30)
> >         ... 46 more
> >
> >
> > Results :
> >
> > Tests in error:
> >
> testNoFilter(org.onehippo.cms7.services.search.jcr.query.TestJcrQueryBuilder):
> java.lang.reflect.InvocationTargetException
> >
> testSimpleFilter(org.onehippo.cms7.services.search.jcr.query.TestJcrQueryBuilder):
> java.lang.reflect.InvocationTargetException
> >
> testANDedChildFilters(org.onehippo.cms7.services.search.jcr.query.TestJcrQueryBuilder):
> java.lang.reflect.InvocationTargetException
> >
> testORedChildFilters(org.onehippo.cms7.services.search.jcr.query.TestJcrQueryBuilder):
> java.lang.reflect.InvocationTargetException
> >
> testOrderByClause(org.onehippo.cms7.services.search.jcr.query.TestJcrQueryBuilder):
> java.lang.reflect.InvocationTargetException
> >
> testOrderByDescendingClause(org.onehippo.cms7.services.search.jcr.query.TestJcrQueryBuilder):
> java.lang.reflect.InvocationTargetException
> >
> testSearch(org.onehippo.cms7.services.search.jcr.service.TestHippoJcrSearchService):
> java.lang.reflect.InvocationTargetException
> >
> testSelect(org.onehippo.cms7.services.search.jcr.service.TestHippoJcrSearchService):
> java.lang.reflect.InvocationTargetException
> >
> testPersist(org.onehippo.cms7.services.search.jcr.service.TestHippoJcrSearchService):
> java.lang.reflect.InvocationTargetException
> >
> testPersistRetrieve(org.onehippo.cms7.services.search.jcr.service.TestHippoJcrSearchService):
> java.lang.reflect.InvocationTargetException
> >
> > Tests run: 14, Failures: 0, Errors: 10, Skipped: 0
> >
> > [INFO]
> ------------------------------------------------------------------------
> > [INFO] Reactor Summary:
> > [INFO]
> > [INFO] Hippo Search Service .............................. SUCCESS
> [4.288s]
> > [INFO] Hippo Search Service API .......................... SUCCESS
> [3.620s]
> > [INFO] Hippo Search Service Commons ...................... SUCCESS
> [4.072s]
> > [INFO] Hippo Search Service JCR .......................... FAILURE
> [9.072s]
> > [INFO] Hippo Search Service Sandbox ...................... SKIPPED
> > [INFO]
> ------------------------------------------------------------------------
> > [INFO] BUILD FAILURE
> > [INFO]
> ------------------------------------------------------------------------
> > [INFO] Total time: 23.352s
> > [INFO] Finished at: Fri Sep 27 04:13:42 CEST 2013
> > [INFO] Final Memory: 16M/38M
> > [INFO]
> ------------------------------------------------------------------------
> > [INFO] o.h.m.e.h.MavenExecutionResultHandler - Build failed with
> exception(s)
> > [INFO] o.h.m.e.h.MavenExecutionResultHandler - [1]
> org.apache.maven.lifecycle.LifecycleExecutionException: Failed to execute
> goal org.apache.maven.plugins:maven-surefire-plugin:2.12.4:test
> (default-test) on project hippo-search-service-jcr: There are test failures.
> >
> > Please refer to <
> https://builds.onehippo.org/job/Hippo%20Search%20Service%20Trunk/ws/jcr/target/surefire-reports>
> for the individual test results.
> > [DEBUG] Closing connection to remote
> > [ERROR] Failed to execute goal
> org.apache.maven.plugins:maven-surefire-plugin:2.12.4:test (default-test)
> on project hippo-search-service-jcr: There are test failures.
> > [ERROR]
> > [ERROR] Please refer to <
> https://builds.onehippo.org/job/Hippo%20Search%20Service%20Trunk/ws/jcr/target/surefire-reports>
> for the individual test results.
> > [ERROR] -> [Help 1]
> > org.apache.maven.lifecycle.LifecycleExecutionException: Failed to
> execute goal org.apache.maven.plugins:maven-surefire-plugin:2.12.4:test
> (default-test) on project hippo-search-service-jcr: There are test failures.
> >
> > Please refer to <
> https://builds.onehippo.org/job/Hippo%20Search%20Service%20Trunk/ws/jcr/target/surefire-reports>
> for the individual test results.
> >         at
> org.apache.maven.lifecycle.internal.MojoExecutor.execute(MojoExecutor.java:213)
> >         at
> org.apache.maven.lifecycle.internal.MojoExecutor.execute(MojoExecutor.java:153)
> >         at
> org.apache.maven.lifecycle.internal.MojoExecutor.execute(MojoExecutor.java:145)
> >         at
> org.apache.maven.lifecycle.internal.LifecycleModuleBuilder.buildProject(LifecycleModuleBuilder.java:84)
> >         at
> org.apache.maven.lifecycle.internal.LifecycleModuleBuilder.buildProject(LifecycleModuleBuilder.java:59)
> >         at
> org.apache.maven.lifecycle.internal.LifecycleStarter.singleThreadedBuild(LifecycleStarter.java:183)
> >         at
> org.apache.maven.lifecycle.internal.LifecycleStarter.execute(LifecycleStarter.java:161)
> >         at org.apache.maven.DefaultMaven.doExecute(DefaultMaven.java:320)
> >         at org.apache.maven.DefaultMaven.execute(DefaultMaven.java:156)
> >         at org.apache.maven.cli.MavenCli.execute(MavenCli.java:537)
> >         at org.apache.maven.cli.MavenCli.doMain(MavenCli.java:196)
> >         at org.apache.maven.cli.MavenCli.main(MavenCli.java:141)
> >         at sun.reflect.NativeMethodAccessorImpl.invoke0(Native Method)
> >         at
> sun.reflect.NativeMethodAccessorImpl.invoke(NativeMethodAccessorImpl.java:57)
> >         at
> sun.reflect.DelegatingMethodAccessorImpl.invoke(DelegatingMethodAccessorImpl.java:43)
> >         at java.lang.reflect.Method.invoke(Method.java:601)
> >         at
> org.codehaus.plexus.classworlds.launcher.Launcher.launchEnhanced(Launcher.java:290)
> >         at
> org.codehaus.plexus.classworlds.launcher.Launcher.launch(Launcher.java:230)
> >         at
> org.codehaus.plexus.classworlds.launcher.Launcher.mainWithExitCode(Launcher.java:409)
> >         at
> org.codehaus.plexus.classworlds.launcher.Launcher.main(Launcher.java:352)
> > Caused by: org.apache.maven.plugin.MojoFailureException: There are test
> failures.
> >
> > Please refer to <
> https://builds.onehippo.org/job/Hippo%20Search%20Service%20Trunk/ws/jcr/target/surefire-reports>
> for the individual test results.
> >         at
> org.apache.maven.plugin.surefire.SurefireHelper.reportExecution(SurefireHelper.java:83)
> >         at
> org.apache.maven.plugin.surefire.SurefirePlugin.writeSummary(SurefirePlugin.java:176)
> >         at
> org.apache.maven.plugin.surefire.SurefirePlugin.handleSummary(SurefirePlugin.java:150)
> >         at
> org.apache.maven.plugin.surefire.AbstractSurefireMojo.executeAfterPreconditionsChecked(AbstractSurefireMojo.java:650)
> >         at
> org.apache.maven.plugin.surefire.AbstractSurefireMojo.execute(AbstractSurefireMojo.java:586)
> >         at
> org.apache.maven.plugin.DefaultBuildPluginManager.executeMojo(DefaultBuildPluginManager.java:101)
> >         at
> org.apache.maven.lifecycle.internal.MojoExecutor.execute(MojoExecutor.java:209)
> >         ... 19 more
> > [ERROR]
> > [ERROR] Re-run Maven using the -X switch to enable full debug logging.
> > [ERROR]
> > [ERROR] For more information about the errors and possible solutions,
> please read the following articles:
> > [ERROR] [Help 1]
> http://cwiki.apache.org/confluence/display/MAVEN/MojoFailureException
> > [ERROR]
> > [ERROR] After correcting the problems, you can resume the build with the
> command
> > [ERROR]   mvn <goals> -rf :hippo-search-service-jcr
> > [DEBUG] Waiting for process to finish
> > [DEBUG] Result: 1
> > Skipping sonar analysis due to bad build status FAILURE
> >
> > --
> > This message is automatically generated by Hudson.
> > For more information on Hudson, see: http://hudson-ci.org/
> > _______________________________________________
> > Hippo-cms7-dev mailing list and forums
> > http://www.onehippo.org/cms7/support/forums.html
> _______________________________________________
> Hippo-cms7-dev mailing list and forums
> http://www.onehippo.org/cms7/support/forums.html
>
-------------- next part --------------
An HTML attachment was scrubbed...
URL: <http://lists.onehippo.org/pipermail/hippo-cms7-dev/attachments/20130927/fbe28093/attachment.html>


More information about the Hippo-cms7-dev mailing list