[Hippo-cms7-dev] [Hudson] Build failed in Hudson: Repository Integration Trunk #687

Hippo Integration Hudson Server beheer at onehippo.com
Fri Sep 27 10:07:22 CEST 2013


See <https://integration.onehippo.com/job/Repository%20Integration%20Trunk/687/>

------------------------------------------
[...truncated 346254 lines...]
	at org.apache.jackrabbit.core.version.InternalFrozenNodeImpl.checkin(InternalFrozenNodeImpl.java:299)
	at org.apache.jackrabbit.core.version.InternalFrozenNodeImpl.checkin(InternalFrozenNodeImpl.java:299)
	at org.apache.jackrabbit.core.version.InternalFrozenNodeImpl.checkin(InternalFrozenNodeImpl.java:299)
	at org.apache.jackrabbit.core.version.InternalFrozenNodeImpl.checkin(InternalFrozenNodeImpl.java:299)
	at org.apache.jackrabbit.core.version.InternalFrozenNodeImpl.checkin(InternalFrozenNodeImpl.java:299)
	at org.apache.jackrabbit.core.version.InternalFrozenNodeImpl.checkin(InternalFrozenNodeImpl.java:299)
	at org.apache.jackrabbit.core.version.InternalFrozenNodeImpl.checkin(InternalFrozenNodeImpl.java:299)
	at org.apache.jackrabbit.core.version.InternalFrozenNodeImpl.checkin(InternalFrozenNodeImpl.java:299)
	at org.apache.jackrabbit.core.version.InternalFrozenNodeImpl.checkin(InternalFrozenNodeImpl.java:299)
	at org.apache.jackrabbit.core.version.InternalFrozenNodeImpl.checkin(InternalFrozenNodeImpl.java:299)
	at org.apache.jackrabbit.core.version.InternalFrozenNodeImpl.checkin(InternalFrozenNodeImpl.java:299)
	at org.apache.jackrabbit.core.version.InternalFrozenNodeImpl.checkin(InternalFrozenNodeImpl.java:299)
	at org.apache.jackrabbit.core.version.InternalFrozenNodeImpl.checkin(InternalFrozenNodeImpl.java:299)
	at org.apache.jackrabbit.core.version.InternalFrozenNodeImpl.checkin(InternalFrozenNodeImpl.java:299)
	at org.apache.jackrabbit.core.version.InternalFrozenNodeImpl.checkin(InternalFrozenNodeImpl.java:299)
	at org.apache.jackrabbit.core.version.InternalFrozenNodeImpl.checkin(InternalFrozenNodeImpl.java:299)
	at org.apache.jackrabbit.core.version.InternalFrozenNodeImpl.checkin(InternalFrozenNodeImpl.java:299)
	at org.apache.jackrabbit.core.version.InternalFrozenNodeImpl.checkin(InternalFrozenNodeImpl.java:299)
	at org.apache.jackrabbit.core.version.InternalFrozenNodeImpl.checkin(InternalFrozenNodeImpl.java:299)
	at org.apache.jackrabbit.core.version.InternalFrozenNodeImpl.checkin(InternalFrozenNodeImpl.java:299)
	at org.apache.jackrabbit.core.version.InternalFrozenNodeImpl.checkin(InternalFrozenNodeImpl.java:299)
	at org.apache.jackrabbit.core.version.InternalFrozenNodeImpl.checkin(InternalFrozenNodeImpl.java:299)
	at org.apache.jackrabbit.core.version.InternalFrozenNodeImpl.checkin(InternalFrozenNodeImpl.java:299)
	at org.apache.jackrabbit.core.version.InternalFrozenNodeImpl.checkin(InternalFrozenNodeImpl.java:299)
	at org.apache.jackrabbit.core.version.InternalFrozenNodeImpl.checkin(InternalFrozenNodeImpl.java:299)
	at org.apache.jackrabbit.core.version.InternalFrozenNodeImpl.checkin(InternalFrozenNodeImpl.java:299)
	at org.apache.jackrabbit.core.version.InternalFrozenNodeImpl.checkin(InternalFrozenNodeImpl.java:299)
	at org.apache.jackrabbit.core.version.InternalFrozenNodeImpl.checkin(InternalFrozenNodeImpl.java:299)
	at org.apache.jackrabbit.core.version.InternalFrozenNodeImpl.checkin(InternalFrozenNodeImpl.java:299)
	at org.apache.jackrabbit.core.version.InternalFrozenNodeImpl.checkin(InternalFrozenNodeImpl.java:299)
	at org.apache.jackrabbit.core.version.InternalFrozenNodeImpl.checkin(InternalFrozenNodeImpl.java:299)
	at org.apache.jackrabbit.core.version.InternalFrozenNodeImpl.checkin(InternalFrozenNodeImpl.java:299)
	at org.apache.jackrabbit.core.version.InternalFrozenNodeImpl.checkin(InternalFrozenNodeImpl.java:299)
	at org.apache.jackrabbit.core.version.InternalFrozenNodeImpl.checkin(InternalFrozenNodeImpl.java:299)
	at org.apache.jackrabbit.core.version.InternalFrozenNodeImpl.checkin(InternalFrozenNodeImpl.java:299)
	at org.apache.jackrabbit.core.version.InternalFrozenNodeImpl.checkin(InternalFrozenNodeImpl.java:299)
	at org.apache.jackrabbit.core.version.InternalFrozenNodeImpl.checkin(InternalFrozenNodeImpl.java:299)
	at org.apache.jackrabbit.core.version.InternalFrozenNodeImpl.checkin(InternalFrozenNodeImpl.java:299)
	at org.apache.jackrabbit.core.version.InternalFrozenNodeImpl.checkin(InternalFrozenNodeImpl.java:299)
	at org.apache.jackrabbit.core.version.InternalFrozenNodeImpl.checkin(InternalFrozenNodeImpl.java:299)
	at org.apache.jackrabbit.core.version.InternalFrozenNodeImpl.checkin(InternalFrozenNodeImpl.java:299)
	at org.apache.jackrabbit.core.version.InternalFrozenNodeImpl.checkin(InternalFrozenNodeImpl.java:299)
	at org.apache.jackrabbit.core.version.InternalFrozenNodeImpl.checkin(InternalFrozenNodeImpl.java:299)
	at org.apache.jackrabbit.core.version.InternalFrozenNodeImpl.checkin(InternalFrozenNodeImpl.java:299)
	at org.apache.jackrabbit.core.version.InternalFrozenNodeImpl.checkin(InternalFrozenNodeImpl.java:299)
	at org.apache.jackrabbit.core.version.InternalFrozenNodeImpl.checkin(InternalFrozenNodeImpl.java:299)
	at org.apache.jackrabbit.core.version.InternalFrozenNodeImpl.checkin(InternalFrozenNodeImpl.java:299)
	at org.apache.jackrabbit.core.version.InternalFrozenNodeImpl.checkin(InternalFrozenNodeImpl.java:299)
	at org.apache.jackrabbit.core.version.InternalFrozenNodeImpl.checkin(InternalFrozenNodeImpl.java:299)
	at org.apache.jackrabbit.core.version.InternalFrozenNodeImpl.checkin(InternalFrozenNodeImpl.java:299)
	at org.apache.jackrabbit.core.version.InternalFrozenNodeImpl.checkin(InternalFrozenNodeImpl.java:299)
	at org.apache.jackrabbit.core.version.InternalFrozenNodeImpl.checkin(InternalFrozenNodeImpl.java:299)
	at org.apache.jackrabbit.core.version.InternalFrozenNodeImpl.checkin(InternalFrozenNodeImpl.java:299)
	at org.apache.jackrabbit.core.version.InternalFrozenNodeImpl.checkin(InternalFrozenNodeImpl.java:299)
	at org.apache.jackrabbit.core.version.InternalFrozenNodeImpl.checkin(InternalFrozenNodeImpl.java:299)
	at org.apache.jackrabbit.core.version.InternalFrozenNodeImpl.checkin(InternalFrozenNodeImpl.java:299)
	at org.apache.jackrabbit.core.version.InternalFrozenNodeImpl.checkin(InternalFrozenNodeImpl.java:299)
	at org.apache.jackrabbit.core.version.InternalFrozenNodeImpl.checkin(InternalFrozenNodeImpl.java:299)
	at org.apache.jackrabbit.core.version.InternalFrozenNodeImpl.checkin(InternalFrozenNodeImpl.java:299)
	at org.apache.jackrabbit.core.version.InternalFrozenNodeImpl.checkin(InternalFrozenNodeImpl.java:299)
	at org.apache.jackrabbit.core.version.InternalFrozenNodeImpl.checkin(InternalFrozenNodeImpl.java:299)
	at org.apache.jackrabbit.core.version.InternalFrozenNodeImpl.checkin(InternalFrozenNodeImpl.java:299)
	at org.apache.jackrabbit.core.version.InternalFrozenNodeImpl.checkin(InternalFrozenNodeImpl.java:299)
	at org.apache.jackrabbit.core.version.InternalFrozenNodeImpl.checkin(InternalFrozenNodeImpl.java:299)
	at org.apache.jackrabbit.core.version.InternalFrozenNodeImpl.checkin(InternalFrozenNodeImpl.java:299)
	at org.apache.jackrabbit.core.version.InternalFrozenNodeImpl.checkin(InternalFrozenNodeImpl.java:299)
	at org.apache.jackrabbit.core.version.InternalFrozenNodeImpl.checkin(InternalFrozenNodeImpl.java:299)
	at org.apache.jackrabbit.core.version.InternalFrozenNodeImpl.checkin(InternalFrozenNodeImpl.java:299)
	at org.apache.jackrabbit.core.version.InternalFrozenNodeImpl.checkin(InternalFrozenNodeImpl.java:299)
	at org.apache.jackrabbit.core.version.InternalFrozenNodeImpl.checkin(InternalFrozenNodeImpl.java:299)
	at org.apache.jackrabbit.core.version.InternalFrozenNodeImpl.checkin(InternalFrozenNodeImpl.java:299)
	at org.apache.jackrabbit.core.version.InternalFrozenNodeImpl.checkin(InternalFrozenNodeImpl.java:299)
	at org.apache.jackrabbit.core.version.InternalFrozenNodeImpl.checkin(InternalFrozenNodeImpl.java:299)
	at org.apache.jackrabbit.core.version.InternalFrozenNodeImpl.checkin(InternalFrozenNodeImpl.java:299)
	at org.apache.jackrabbit.core.version.InternalFrozenNodeImpl.checkin(InternalFrozenNodeImpl.java:299)
	at org.apache.jackrabbit.core.version.InternalFrozenNodeImpl.checkin(InternalFrozenNodeImpl.java:299)
	at org.apache.jackrabbit.core.version.InternalFrozenNodeImpl.checkin(InternalFrozenNodeImpl.java:299)
	at org.apache.jackrabbit.core.version.InternalFrozenNodeImpl.checkin(InternalFrozenNodeImpl.java:299)
	at org.apache.jackrabbit.core.version.InternalFrozenNodeImpl.checkin(InternalFrozenNodeImpl.java:299)
	at org.apache.jackrabbit.core.version.InternalFrozenNodeImpl.checkin(InternalFrozenNodeImpl.java:299)
	at org.apache.jackrabbit.core.version.InternalFrozenNodeImpl.checkin(InternalFrozenNodeImpl.java:299)
	at org.apache.jackrabbit.core.version.InternalFrozenNodeImpl.checkin(InternalFrozenNodeImpl.java:299)
	at org.apache.jackrabbit.core.version.InternalFrozenNodeImpl.checkin(InternalFrozenNodeImpl.java:299)
	at org.apache.jackrabbit.core.version.InternalFrozenNodeImpl.checkin(InternalFrozenNodeImpl.java:299)
	at org.apache.jackrabbit.core.version.InternalFrozenNodeImpl.checkin(InternalFrozenNodeImpl.java:299)
	at org.apache.jackrabbit.core.version.InternalFrozenNodeImpl.checkin(InternalFrozenNodeImpl.java:299)
	at org.apache.jackrabbit.core.version.InternalFrozenNodeImpl.checkin(InternalFrozenNodeImpl.java:299)
	at org.apache.jackrabbit.core.version.InternalFrozenNodeImpl.checkin(InternalFrozenNodeImpl.java:299)
	at org.apache.jackrabbit.core.version.InternalFrozenNodeImpl.checkin(InternalFrozenNodeImpl.java:299)
	at org.apache.jackrabbit.core.version.InternalFrozenNodeImpl.checkin(InternalFrozenNodeImpl.java:299)
	at org.apache.jackrabbit.core.version.InternalFrozenNodeImpl.checkin(InternalFrozenNodeImpl.java:299)
	at org.apache.jackrabbit.core.version.InternalFrozenNodeImpl.checkin(InternalFrozenNodeImpl.java:299)
	at org.apache.jackrabbit.core.version.InternalFrozenNodeImpl.checkin(InternalFrozenNodeImpl.java:299)
	at org.apache.jackrabbit.core.version.InternalFrozenNodeImpl.checkin(InternalFrozenNodeImpl.java:299)
	at org.apache.jackrabbit.core.version.InternalFrozenNodeImpl.checkin(InternalFrozenNodeImpl.java:299)
	at org.apache.jackrabbit.core.version.InternalFrozenNodeImpl.checkin(InternalFrozenNodeImpl.java:299)
	at org.apache.jackrabbit.core.version.InternalFrozenNodeImpl.checkin(InternalFrozenNodeImpl.java:299)
	at org.apache.jackrabbit.core.version.InternalFrozenNodeImpl.checkin(InternalFrozenNodeImpl.java:299)
	at org.apache.jackrabbit.core.version.InternalFrozenNodeImpl.checkin(InternalFrozenNodeImpl.java:299)
	at org.apache.jackrabbit.core.version.InternalFrozenNodeImpl.checkin(InternalFrozenNodeImpl.java:299)
	at org.apache.jackrabbit.core.version.InternalFrozenNodeImpl.checkin(InternalFrozenNodeImpl.java:299)
	at org.apache.jackrabbit.core.version.InternalFrozenNodeImpl.checkin(InternalFrozenNodeImpl.java:299)
	at org.apache.jackrabbit.core.version.InternalFrozenNodeImpl.checkin(InternalFrozenNodeImpl.java:299)
	at org.apache.jackrabbit.core.version.InternalFrozenNodeImpl.checkin(InternalFrozenNodeImpl.java:299)
	at org.apache.jackrabbit.core.version.InternalFrozenNodeImpl.checkin(InternalFrozenNodeImpl.java:299)
	at org.apache.jackrabbit.core.version.InternalFrozenNodeImpl.checkin(InternalFrozenNodeImpl.java:299)
	at org.apache.jackrabbit.core.version.InternalFrozenNodeImpl.checkin(InternalFrozenNodeImpl.java:299)
	at org.apache.jackrabbit.core.version.InternalFrozenNodeImpl.checkin(InternalFrozenNodeImpl.java:299)
	at org.apache.jackrabbit.core.version.InternalFrozenNodeImpl.checkin(InternalFrozenNodeImpl.java:299)
	at org.apache.jackrabbit.core.version.InternalFrozenNodeImpl.checkin(InternalFrozenNodeImpl.java:299)
Tests run: 2, Failures: 1, Errors: 0, Skipped: 0, Time elapsed: 107.968 sec <<< FAILURE! - in org.hippoecm.repository.concurrent.StampedeTest
stampede[0](org.hippoecm.repository.concurrent.StampedeTest)  Time elapsed: 104.868 sec  <<< FAILURE!
java.lang.AssertionError: 
	at org.junit.Assert.fail(Assert.java:74)
	at org.junit.Assert.fail(Assert.java:81)
	at org.hippoecm.repository.concurrent.StampedeTest.stampede(StampedeTest.java:133)

Running org.hippoecm.repository.updater.UpdaterTest
Tests run: 3, Failures: 0, Errors: 0, Skipped: 0, Time elapsed: 0 sec - in org.hippoecm.repository.updater.UpdaterTest
Running org.hippoecm.repository.sample.SampleRemoteWorkflowTest
Tests run: 2, Failures: 0, Errors: 0, Skipped: 0, Time elapsed: 0 sec - in org.hippoecm.repository.sample.SampleRemoteWorkflowTest
Running org.hippoecm.repository.facetnavigation.FacetedNavigationConcurrencyTest
Tests run: 4, Failures: 0, Errors: 0, Skipped: 0, Time elapsed: 0 sec - in org.hippoecm.repository.facetnavigation.FacetedNavigationConcurrencyTest
Running org.hippoecm.repository.TotalSizeTest
Tests run: 4, Failures: 0, Errors: 0, Skipped: 0, Time elapsed: 0 sec - in org.hippoecm.repository.TotalSizeTest
Running org.hippoecm.repository.test.RemoteTest
Tests run: 1, Failures: 0, Errors: 0, Skipped: 1, Time elapsed: 0 sec - in org.hippoecm.repository.test.RemoteTest
Running org.hippoecm.repository.test.WorkflowChainingTest
Tests run: 2, Failures: 0, Errors: 1, Skipped: 0, Time elapsed: 0 sec <<< FAILURE! - in org.hippoecm.repository.test.WorkflowChainingTest
testScheduled(org.hippoecm.repository.test.WorkflowChainingTest)  Time elapsed: 0 sec  <<< ERROR!
java.lang.Exception: Configuration has been changed, but not reverted; make sure changes in tearDown overrides are saved.  Detected changes: added = [], changed = [hippo:workflows], removed = [].  Use RepositoryTestCase#setConfigurationChangeDebugPath to narrow down.
	at org.onehippo.repository.testutils.RepositoryTestCase.checkState(RepositoryTestCase.java:268)
	at org.onehippo.repository.testutils.RepositoryTestCase.tearDown(RepositoryTestCase.java:184)
	at org.onehippo.repository.testutils.RepositoryTestCase.tearDown(RepositoryTestCase.java:174)
	at org.hippoecm.repository.test.WorkflowChainingTest.tearDown(WorkflowChainingTest.java:87)

Running org.hippoecm.repository.decorating.MirrorTest
Tests run: 4, Failures: 0, Errors: 0, Skipped: 0, Time elapsed: 10.348 sec - in org.hippoecm.repository.decorating.MirrorTest
Running org.hippoecm.repository.integration.VersioningWorkflowTest
Tests run: 4, Failures: 1, Errors: 0, Skipped: 0, Time elapsed: 9.668 sec <<< FAILURE! - in org.hippoecm.repository.integration.VersioningWorkflowTest
testVersion(org.hippoecm.repository.integration.VersioningWorkflowTest)  Time elapsed: 0.232 sec  <<< FAILURE!
org.junit.ComparisonFailure: expected:<admin[]> but was:<admin[.]>
	at org.junit.Assert.assertEquals(Assert.java:99)
	at org.junit.Assert.assertEquals(Assert.java:117)
	at org.hippoecm.repository.integration.VersioningWorkflowTest.testVersion(VersioningWorkflowTest.java:188)

Running org.onehippo.repository.update.UpdaterExecutorTest
Tests run: 3, Failures: 0, Errors: 0, Skipped: 0, Time elapsed: 24.616 sec - in org.onehippo.repository.update.UpdaterExecutorTest

Results :

Failed tests: 
  StampedeTest.stampede:133 
  VersioningWorkflowTest.testVersion:188 expected:<admin[]> but was:<admin[.]>

Tests in error: 
  WorkflowChainingTest.tearDown:87->RepositoryTestCase.tearDown:174->RepositoryTestCase.tearDown:184->RepositoryTestCase.checkState:268 ? 

Tests run: 29, Failures: 2, Errors: 1, Skipped: 1

[WARNING] File encoding has not been set, using platform encoding ANSI_X3.4-1968, i.e. build is platform dependent!
[INFO] 
[INFO] --- maven-failsafe-plugin:2.16:verify (default) @ hippo-repository-test ---
[INFO] Failsafe report directory: <https://integration.onehippo.com/job/Repository%20Integration%20Trunk/ws/test/target/failsafe-reports>
[WARNING] File encoding has not been set, using platform encoding ANSI_X3.4-1968, i.e. build is platform dependent!
[INFO] ------------------------------------------------------------------------
[INFO] Reactor Summary:
[INFO] 
[INFO] Repository ........................................ SUCCESS [3.124s]
[INFO] Repository API .................................... SUCCESS [5.176s]
[INFO] Repository Utilities .............................. SUCCESS [2.068s]
[INFO] Repository Connector .............................. SUCCESS [4.684s]
[INFO] Repository Provider Module Interface .............. SUCCESS [2.116s]
[INFO] Repository Test Utilities ......................... SUCCESS [3.452s]
[INFO] Repository Builtin workflow ....................... SUCCESS [1.156s]
[INFO] Repository Engine ................................. SUCCESS [2:11.120s]
[INFO] Repository Default Configuration .................. SUCCESS [22.928s]
[INFO] Repository Modules ................................ SUCCESS [26.344s]
[INFO] Repository Test Content ........................... SUCCESS [0.212s]
[INFO] Repository Deprecated ............................. SUCCESS [0.076s]
[INFO] Repository Deprecated Facetselect Mirror .......... SUCCESS [22.972s]
[INFO] Repository workflow implementations ............... SUCCESS [8:18.708s]
[INFO] Repository Deprecated Translation ................. SUCCESS [21.072s]
[INFO] Repository Deprecated Facetsearch ................. SUCCESS [33.728s]
[INFO] Repository Upgrade Module ......................... SUCCESS [11.344s]
[INFO] Repository Upgrade ................................ SUCCESS [0.064s]
[INFO] Repository Handle Migration ....................... SUCCESS [39.576s]
[INFO] Repository Test ................................... FAILURE [7:39.964s]
[INFO] Repository LDAP based Authorization ............... SKIPPED
[INFO] Repository Resources .............................. SKIPPED
[INFO] Repository Servlets ............................... SKIPPED
[INFO] Repository Dependencies ........................... SKIPPED
[INFO] ------------------------------------------------------------------------
[INFO] BUILD FAILURE
[INFO] ------------------------------------------------------------------------
[INFO] Total time: 21:33.908s
[INFO] Finished at: Fri Sep 27 10:07:21 CEST 2013
[INFO] Final Memory: 19M/136M
[INFO] ------------------------------------------------------------------------
[INFO] o.h.m.e.h.MavenExecutionResultHandler - Build failed with exception(s)
[INFO] o.h.m.e.h.MavenExecutionResultHandler - [1] org.apache.maven.lifecycle.LifecycleExecutionException: Failed to execute goal org.apache.maven.plugins:maven-failsafe-plugin:2.16:verify (default) on project hippo-repository-test: There are test failures.

Please refer to <https://integration.onehippo.com/job/Repository%20Integration%20Trunk/ws/test/target/failsafe-reports> for the individual test results.
[DEBUG] Closing connection to remote
[ERROR] Failed to execute goal org.apache.maven.plugins:maven-failsafe-plugin:2.16:verify (default) on project hippo-repository-test: There are test failures.
[ERROR] 
[ERROR] Please refer to <https://integration.onehippo.com/job/Repository%20Integration%20Trunk/ws/test/target/failsafe-reports> for the individual test results.
[ERROR] -> [Help 1]
org.apache.maven.lifecycle.LifecycleExecutionException: Failed to execute goal org.apache.maven.plugins:maven-failsafe-plugin:2.16:verify (default) on project hippo-repository-test: There are test failures.

Please refer to <https://integration.onehippo.com/job/Repository%20Integration%20Trunk/ws/test/target/failsafe-reports> for the individual test results.
	at org.apache.maven.lifecycle.internal.MojoExecutor.execute(MojoExecutor.java:213)
	at org.apache.maven.lifecycle.internal.MojoExecutor.execute(MojoExecutor.java:153)
	at org.apache.maven.lifecycle.internal.MojoExecutor.execute(MojoExecutor.java:145)
	at org.apache.maven.lifecycle.internal.LifecycleModuleBuilder.buildProject(LifecycleModuleBuilder.java:84)
	at org.apache.maven.lifecycle.internal.LifecycleModuleBuilder.buildProject(LifecycleModuleBuilder.java:59)
	at org.apache.maven.lifecycle.internal.LifecycleStarter.singleThreadedBuild(LifecycleStarter.java:183)
	at org.apache.maven.lifecycle.internal.LifecycleStarter.execute(LifecycleStarter.java:161)
	at org.apache.maven.DefaultMaven.doExecute(DefaultMaven.java:319)
	at org.apache.maven.DefaultMaven.execute(DefaultMaven.java:156)
	at org.apache.maven.cli.MavenCli.execute(MavenCli.java:537)
	at org.apache.maven.cli.MavenCli.doMain(MavenCli.java:196)
	at org.apache.maven.cli.MavenCli.main(MavenCli.java:141)
	at sun.reflect.NativeMethodAccessorImpl.invoke0(Native Method)
	at sun.reflect.NativeMethodAccessorImpl.invoke(NativeMethodAccessorImpl.java:57)
	at sun.reflect.DelegatingMethodAccessorImpl.invoke(DelegatingMethodAccessorImpl.java:43)
	at java.lang.reflect.Method.invoke(Method.java:606)
	at org.codehaus.plexus.classworlds.launcher.Launcher.launchEnhanced(Launcher.java:290)
	at org.codehaus.plexus.classworlds.launcher.Launcher.launch(Launcher.java:230)
	at org.codehaus.plexus.classworlds.launcher.Launcher.mainWithExitCode(Launcher.java:409)
	at org.codehaus.plexus.classworlds.launcher.Launcher.main(Launcher.java:352)
Caused by: org.apache.maven.plugin.MojoFailureException: There are test failures.

Please refer to <https://integration.onehippo.com/job/Repository%20Integration%20Trunk/ws/test/target/failsafe-reports> for the individual test results.
	at org.apache.maven.plugin.surefire.SurefireHelper.reportExecution(SurefireHelper.java:82)
	at org.apache.maven.plugin.failsafe.VerifyMojo.execute(VerifyMojo.java:194)
	at org.apache.maven.plugin.DefaultBuildPluginManager.executeMojo(DefaultBuildPluginManager.java:101)
	at org.apache.maven.lifecycle.internal.MojoExecutor.execute(MojoExecutor.java:209)
	... 19 more
[ERROR] 
[ERROR] Re-run Maven using the -X switch to enable full debug logging.
[ERROR] 
[ERROR] For more information about the errors and possible solutions, please read the following articles:
[ERROR] [Help 1] http://cwiki.apache.org/confluence/display/MAVEN/MojoFailureException
[ERROR] 
[ERROR] After correcting the problems, you can resume the build with the command
[ERROR]   mvn <goals> -rf :hippo-repository-test
[DEBUG] Waiting for process to finish
[DEBUG] Result: 1

--
This message is automatically generated by Hudson. 
For more information on Hudson, see: http://hudson-ci.org/


More information about the Hippo-cms7-dev mailing list