[Hippo-cms7-dev] [Hudson] Build failed in Hudson: hippo-services-contenttype Trunk #176

Hippo Public Hudson Server beheer at onehippo.com
Mon Sep 30 16:45:51 CEST 2013


See <https://builds.onehippo.org/job/hippo-services-contenttype%20Trunk/176/>

------------------------------------------
Started by user adouma
Cleaning up <https://builds.onehippo.org/job/hippo-services-contenttype%20Trunk/ws/.>
Deleting <https://builds.onehippo.org/job/hippo-services-contenttype%20Trunk/ws/.maven>
Updating http://svn.onehippo.org/repos/hippo/hippo-cms7/services/services-contenttype/trunk revision: Sep 30, 2013 4:45:48 PM depth:infinity ignoreExternals: false
At revision 41016
no change for http://svn.onehippo.org/repos/hippo/hippo-cms7/services/services-contenttype/trunk since the previous build
Found mavenVersion 3.0.4 from file jar:file:/home/hudson/software/maven/apache-maven-3.0-latest/lib/maven-core-3.0.4.jar!/META-INF/maven/org.apache.maven/maven-core/pom.properties
[INFO] Using Maven 3 installation: Apache Maven 3.0 latest
[INFO] Checking Maven 3 installation environment
[workspace] $ /home/hudson/software/maven/apache-maven-3.0-latest/bin/mvn --help
[INFO] Checking Maven 3 installation version
[INFO] Detected Maven 3 installation version: 3.0.4
[workspace] $ /home/hudson/software/maven/apache-maven-3.0-latest/bin/mvn validate -Ppedantic -V -B -Dmaven.ext.class.path=/var/hudson-data/maven/slavebundle/resources:/var/hudson-data/maven/slavebundle/lib/maven3-eventspy-3.0.jar:/var/hudson-data/war/webapp/WEB-INF/lib/hudson-remoting-3.0.0.jar -Dhudson.eventspy.port=46519 "-Dmaven.repo.local=<https://builds.onehippo.org/job/hippo-services-contenttype%20Trunk/ws/.maven/repo"> -f pom.xml
[DEBUG] Waiting for connection on port: 46519
Apache Maven 3.0.4 (r1232337; 2012-01-17 09:44:56+0100)
Maven home: /home/hudson/software/maven/apache-maven-3.0-latest
Java version: 1.7.0_10, vendor: Oracle Corporation
Java home: /home/hudson/software/jvm/jdk1.7.0_10/jre
Default locale: en_US, platform encoding: ANSI_X3.4-1968
OS name: "linux", version: "2.6.26-2-xen-amd64", arch: "i386", family: "unix"
[DEBUG] Connected to remote
[INFO] Scanning for projects...
[INFO] o.h.m.e.h.MavenExecutionResultHandler - Build failed with exception(s)
[INFO] o.h.m.e.h.MavenExecutionResultHandler - [1] org.apache.maven.project.ProjectBuildingException: Some problems were encountered while processing the POMs:
[FATAL] Non-resolvable parent POM: Could not find artifact org.onehippo.cms7:hippo-cms7-project:pom:24-SNAPSHOT and 'parent.relativePath' points at wrong local POM @ line 21, column 11

[DEBUG] Closing connection to remote
[ERROR] The build could not read 1 project -> [Help 1]
[ERROR]   
[ERROR]   The project org.onehippo.cms7:hippo-services-contenttype:1.03.01-SNAPSHOT (<https://builds.onehippo.org/job/hippo-services-contenttype%20Trunk/ws/pom.xml)> has 1 error
[ERROR]     Non-resolvable parent POM: Could not find artifact org.onehippo.cms7:hippo-cms7-project:pom:24-SNAPSHOT and 'parent.relativePath' points at wrong local POM @ line 21, column 11 -> [Help 2]
[ERROR] 
[ERROR] To see the full stack trace of the errors, re-run Maven with the -e switch.
[ERROR] Re-run Maven using the -X switch to enable full debug logging.
[ERROR] 
[ERROR] For more information about the errors and possible solutions, please read the following articles:
[ERROR] [Help 1] http://cwiki.apache.org/confluence/display/MAVEN/ProjectBuildingException
[ERROR] [Help 2] http://cwiki.apache.org/confluence/display/MAVEN/UnresolvableModelException
[DEBUG] Waiting for process to finish
[DEBUG] Result: 1
ERROR: Failed to parse POMs
java.io.IOException: Could not execute pre-build steps
	at hudson.plugins.m2extrasteps.M2ExtraStepsWrapper.setUp(M2ExtraStepsWrapper.java:127)
	at hudson.maven.MavenModuleSetBuild$RunnerImpl.doRun(MavenModuleSetBuild.java:537)
	at hudson.model.AbstractBuild$AbstractRunner.run(AbstractBuild.java:434)
	at hudson.model.Run.run(Run.java:1390)
	at hudson.maven.MavenModuleSetBuild.run(MavenModuleSetBuild.java:420)
	at hudson.model.ResourceController.execute(ResourceController.java:82)
	at hudson.model.Executor.run(Executor.java:137)
Skipping sonar analysis due to bad build status FAILURE

--
This message is automatically generated by Hudson. 
For more information on Hudson, see: http://hudson-ci.org/


More information about the Hippo-cms7-dev mailing list